Question,Overall,Field,DC,Male,Female,CS,"FS, SFS, FSL",ISC,USPSC,Other,AMS/FO,CMC,CVP,OTI,PO,0-3,3-5,5-10,10+,#
1.1,0.8467432950191571,0.775,0.8597285067873304,0.8555555555555555,0.8493975903614458,0.9302325581395349,0.7692307692307693,0.8181818181818182,0.8478260869565217,0.875,1,0.7142857142857143,1,0.8383233532934131,0.8235294117647058,0.8333333333333334,0.8947368421052632,0.8392857142857143,0.8571428571428571,1
1.2,0.8314176245210728,0.8,0.8371040723981901,0.8666666666666667,0.8253012048192772,0.8837209302325582,0.717948717948718,0.8181818181818182,0.8405797101449275,1,1,0.7142857142857143,0.8571428571428571,0.8502994011976048,0.7058823529411765,0.7727272727272727,0.9473684210526315,0.8928571428571429,0.8285714285714286,2
1.3,0.7335907335907336,0.5365853658536586,0.7706422018348624,0.7528089887640449,0.7272727272727273,0.8604651162790697,0.6,0.7878787878787878,0.7037037037037037,1,0.9285714285714286,0.6388888888888888,0.8571428571428571,0.7134146341463414,0.7647058823529411,0.7218045112781954,0.7631578947368421,0.7777777777777778,0.6764705882352942,3
1.4,0.6911196911196911,0.5121951219512195,0.7247706422018348,0.7415730337078652,0.6787878787878788,0.8333333333333334,0.625,0.696969696969697,0.6470588235294118,1,0.9285714285714286,0.6388888888888888,0.8518518518518519,0.6545454545454545,0.7058823529411765,0.6717557251908397,0.8157894736842105,0.6363636363636364,0.7142857142857143,4
1.5,0.25868725868725867,0.34146341463414637,0.24311926605504589,0.17582417582417584,0.294478527607362,0.18604651162790697,0.3,0.2727272727272727,0.2740740740740741,0.125,0.21428571428571427,0.3611111111111111,0.21428571428571427,0.2682926829268293,0.058823529411764705,0.22900763358778625,0.35135135135135137,0.26785714285714285,0.2571428571428571,5
1.6,0.6718146718146718,0.6097560975609756,0.6834862385321101,0.7444444444444445,0.6463414634146342,0.7380952380952381,0.6666666666666666,0.7575757575757576,0.6231884057971014,0.8571428571428571,0.8571428571428571,0.6388888888888888,0.6923076923076923,0.6566265060240963,0.7058823529411765,0.6717557251908397,0.7368421052631579,0.6428571428571429,0.6470588235294118,6
