Question,Overall,Field,DC,Male,Female,CS,"FS, SFS, FSL",ISC,USPSC,AMS/FO,CMC,CVP,OTI,PO,0-3,3-5,5-10,10+,#
4.1-OD,0.9209486166007905,0.9736842105263158,0.9116279069767442,0.9438202247191011,0.9130434782608695,0.9761904761904762,0.918918918918919,0.90625,0.9029850746268657,1,0.9705882352941176,1,0.9079754601226994,0.7647058823529411,0.9365079365079365,1,0.8703703703703703,0.8571428571428571,1
4.2-OD,0.8537549407114624,0.8421052631578947,0.8558139534883721,0.8764044943820225,0.8509316770186336,0.9523809523809523,0.8648648648648649,0.84375,0.8134328358208955,1,0.8823529411764706,1,0.8098159509202454,0.8823529411764706,0.8412698412698413,0.9736842105263158,0.7777777777777778,0.8857142857142857,2
4.3-OD,0.7075098814229249,0.7105263157894737,0.7069767441860465,0.7640449438202247,0.6832298136645962,0.8333333333333334,0.6756756756756757,0.6875,0.6791044776119403,1,0.6470588235294118,0.8076923076923077,0.6809815950920245,0.7058823529411765,0.7063492063492064,0.7894736842105263,0.6296296296296297,0.7428571428571429,3
4.4-OD,0.9446640316205533,0.868421052631579,0.958139534883721,0.9438202247191011,0.9565217391304348,0.9761904761904762,0.8918918918918919,0.9375,0.9477611940298507,1,0.8823529411764706,1,0.9447852760736196,0.9411764705882353,0.9206349206349206,1,0.9259259259259259,1,4
4.5-OD,0.8023715415019763,0.7631578947368421,0.8093023255813954,0.8426966292134831,0.7888198757763976,0.9047619047619048,0.8918918918918919,0.8125,0.746268656716418,1,0.8529411764705882,0.9615384615384616,0.754601226993865,0.7647058823529411,0.8492063492063492,0.7894736842105263,0.7037037037037037,0.8,5
4.6-OD,0.8656126482213439,0.868421052631579,0.8651162790697674,0.8876404494382022,0.8571428571428571,0.9523809523809523,0.8648648648648649,0.875,0.835820895522388,1,0.7941176470588235,1,0.8404907975460123,0.9411764705882353,0.873015873015873,0.9210526315789473,0.8148148148148148,0.8571428571428571,6
4.7-OD,0.7944664031620553,0.7368421052631579,0.8046511627906977,0.8202247191011236,0.782608695652174,0.8809523809523809,0.8108108108108109,0.84375,0.7388059701492538,1,0.7941176470588235,0.8846153846153846,0.754601226993865,0.8823529411764706,0.8253968253968254,0.8421052631578947,0.7037037037037037,0.7714285714285715,7
4.8-OD,0.9011857707509882,0.8421052631578947,0.9116279069767442,0.9325842696629213,0.8944099378881988,0.9285714285714286,0.8918918918918919,0.90625,0.8880597014925373,1,0.8823529411764706,1,0.8895705521472392,0.8235294117647058,0.9126984126984127,0.9473684210526315,0.8703703703703703,0.8571428571428571,8
4.9-OD,0.9209486166007905,0.9473684210526315,0.9162790697674419,0.9550561797752809,0.906832298136646,0.9523809523809523,0.8648648648648649,1,0.9029850746268657,1,0.8529411764705882,1,0.9202453987730062,0.8823529411764706,0.9285714285714286,1,0.8703703703703703,0.8857142857142857,9
