meca_strainAtBreak,meca_stressAtBreak,meca_youngModulus,granulo_D50,compo_lignine,compo_cellulose,compo_hemicell,compo_ash,tdc_taux
t_0,t_0,t_2,t_0,t_1,t_1,t_2,t_1,t_3
t_3,t_1,t_1,t_0,t_1,t_1,t_2,t_1,t_1
t_1,t_0,t_1,t_1,t_2,t_0,t_0,t_0,t_2
t_0,t_0,t_1,t_1,t_2,t_0,t_0,t_0,t_3
t_1,t_1,t_2,t_1,t_2,t_0,t_0,t_0,t_1
t_1,t_0,t_1,t_1,t_2,t_2,t_0,t_0,t_2
t_1,t_0,t_1,t_1,t_2,t_0,t_0,t_1,t_2
t_1,t_0,t_1,t_1,t_2,t_0,t_0,t_1,t_3
t_2,t_0,t_1,t_1,t_2,t_0,t_0,t_1,t_1
t_1,t_0,t_1,t_1,t_2,t_0,t_1,t_0,t_2
t_0,t_0,t_1,t_1,t_2,t_0,t_1,t_0,t_3
t_1,t_0,t_1,t_1,t_2,t_0,t_1,t_0,t_1
t_0,t_1,t_2,t_2,t_1,t_0,t_1,t_2,t_2
t_0,t_0,t_1,t_2,t_1,t_0,t_1,t_2,t_3
t_1,t_1,t_1,t_2,t_1,t_0,t_1,t_2,t_1
t_1,t_1,t_1,t_0,t_1,t_0,t_1,t_2,t_2
t_0,t_0,t_2,t_0,t_1,t_0,t_1,t_2,t_3
t_1,t_1,t_2,t_0,t_1,t_0,t_1,t_2,t_1
t_0,t_0,t_2,t_2,t_1,t_1,t_2,t_1,t_2
t_0,t_0,t_2,t_2,t_1,t_1,t_2,t_1,t_3
t_1,t_1,t_2,t_2,t_1,t_1,t_2,t_1,t_1
t_1,t_0,t_1,t_2,t_1,t_2,t_2,t_1,t_2
t_2,t_0,t_1,t_0,t_1,t_1,t_1,t_1,t_0
t_1,t_0,t_1,t_0,t_1,t_1,t_1,t_1,t_1
t_2,t_2,t_2,t_0,t_1,t_1,t_0,t_1,t_0
t_1,t_0,t_1,t_0,t_1,t_1,t_0,t_1,t_1
t_2,t_0,t_0,t_2,t_1,t_2,t_1,t_0,t_0
t_1,t_0,t_0,t_2,t_1,t_2,t_1,t_0,t_1
t_1,t_1,t_2,t_1,t_0,t_3,t_0,t_0,t_1
t_0,t_0,t_2,t_1,t_0,t_3,t_0,t_0,t_2
t_0,t_0,t_2,t_1,t_0,t_3,t_0,t_0,t_3
t_1,t_1,t_1,t_1,t_0,t_3,t_0,t_0,t_1
t_0,t_0,t_2,t_1,t_0,t_3,t_0,t_0,t_3
t_1,t_0,t_0,t_2,t_0,t_2,t_1,t_1,t_0
t_2,t_0,t_0,t_2,t_0,t_2,t_1,t_1,t_1
t_1,t_0,t_1,t_0,t_2,t_0,t_0,t_0,t_0
t_1,t_0,t_1,t_0,t_2,t_0,t_0,t_0,t_1
t_1,t_0,t_2,t_0,t_0,t_3,t_0,t_0,t_1
t_0,t_0,t_2,t_0,t_0,t_3,t_0,t_0,t_2
t_1,t_1,t_2,t_0,t_0,t_3,t_0,t_0,t_1
t_0,t_0,t_2,t_0,t_0,t_3,t_0,t_0,t_2
t_2,t_0,t_2,t_0,t_0,t_1,t_2,t_1,t_0
t_1,t_0,t_2,t_0,t_0,t_1,t_1,t_1,t_2
t_1,t_0,t_1,t_0,t_0,t_1,t_2,t_1,t_1
t_1,t_0,t_1,t_2,t_2,t_0,t_0,t_1,t_0
t_1,t_0,t_0,t_2,t_2,t_0,t_0,t_1,t_1
t_1,t_0,t_2,t_2,t_0,t_1,t_1,t_1,t_1
t_1,t_0,t_0,t_2,t_0,t_2,t_2,t_1,t_0
t_0,t_0,t_2,t_2,t_0,t_1,t_1,t_1,t_2
t_0,t_0,t_2,t_2,t_0,t_1,t_1,t_1,t_3
t_1,t_0,t_0,t_2,t_0,t_2,t_2,t_1,t_1
t_1,t_1,t_2,t_2,t_1,t_0,t_1,t_2,t_2
t_2,t_1,t_2,t_2,t_1,t_0,t_1,t_2,t_3
t_2,t_1,t_1,t_2,t_1,t_0,t_1,t_2,t_1
t_2,t_1,t_2,t_2,t_2,t_0,t_0,t_2,t_2
t_1,t_1,t_2,t_2,t_2,t_0,t_0,t_2,t_3
t_1,t_1,t_2,t_2,t_2,t_0,t_0,t_2,t_1
t_1,t_1,t_2,t_1,t_2,t_0,t_1,t_2,t_2
t_1,t_1,t_2,t_1,t_2,t_0,t_1,t_2,t_3
t_2,t_2,t_2,t_1,t_2,t_0,t_1,t_2,t_1
t_2,t_1,t_2,t_2,t_2,t_1,t_0,t_2,t_2
t_1,t_1,t_2,t_2,t_2,t_1,t_0,t_2,t_3
t_1,t_2,t_2,t_2,t_2,t_1,t_0,t_2,t_1
t_2,t_1,t_1,t_2,t_1,t_0,t_1,t_2,t_2
t_2,t_1,t_2,t_2,t_1,t_0,t_1,t_2,t_3
t_2,t_1,t_1,t_2,t_1,t_0,t_1,t_2,t_1
t_1,t_1,t_2,t_2,t_1,t_1,t_2,t_1,t_2
t_1,t_2,t_2,t_2,t_1,t_1,t_2,t_1,t_3
t_1,t_1,t_2,t_2,t_1,t_1,t_2,t_1,t_1
t_1,t_1,t_2,t_1,t_0,t_2,t_2,t_0,t_1
t_0,t_0,t_2,t_1,t_0,t_2,t_2,t_0,t_2
t_0,t_0,t_2,t_1,t_0,t_2,t_2,t_0,t_3
t_1,t_1,t_2,t_1,t_0,t_2,t_2,t_0,t_1
t_1,t_1,t_2,t_1,t_0,t_2,t_2,t_0,t_1
t_0,t_1,t_2,t_1,t_0,t_2,t_2,t_0,t_2
t_0,t_0,t_2,t_1,t_0,t_2,t_2,t_0,t_3
t_1,t_1,t_2,t_1,t_0,t_2,t_2,t_0,t_1
t_2,t_2,t_2,t_2,t_1,t_2,t_2,t_0,t_2
t_3,t_1,t_2,t_2,t_1,t_2,t_2,t_0,t_3
t_3,t_2,t_2,t_2,t_1,t_2,t_2,t_0,t_1
