
//-------------------------
//     Variables
//-------------------------

type D50 labels (t_0, t_1, t_2); 
type CELLULOSE labels (t_0, t_1, t_2, t_3); 
type LIGNINE labels (t_0, t_1, t_2); 
type HEMICELL labels (t_0, t_1, t_2); 
type ASH labels (t_0, t_1, t_2); 
type TAUX labels (t_0, t_1, t_2, t_3); 
type CRYSTALLIZATION labels (t_0, t_1, t_2, t_3); 
type MELTINGPOINT labels (t_0, t_1, t_2); 
type YOUNGMODULUS labels (t_0, t_1, t_2); 
type STRESSATBREAK labels (t_0, t_1, t_2); 
type STRAINATBREAK labels (t_0, t_1, t_2, t_3); 
type H2O labels (t_0, t_1, t_2); 
type ONSET labels (t_0, t_1, t_2); 
type DEGRADATION labels (t_0, t_1, t_2); 

//-------------------------
//     Classes
//-------------------------

class GRANULO {
	 D50 d50 {[0.2713178294573643, 0.3062015503875969, 0.4224806201550388]};
}
class COMPO {
	 CELLULOSE cellulose {[0.3633720930232558, 0.2819767441860465, 0.2238372093023256, 0.1308139534883721]};
	 LIGNINE lignine {[0.3643410852713178, 0.3643410852713178, 0.2713178294573643]};
	 HEMICELL hemicell {[0.3527131782945736, 0.3527131782945736, 0.2945736434108527]};
	 ASH ash {[0.3875968992248062, 0.3643410852713178, 0.24806201550387597]};
}
class TDC {
	 TAUX taux {[0.09593023255813954, 0.39825581395348836, 0.2703488372093023, 0.23546511627906977]};
}
class DSC {
	 TDC tdc;
	 CRYSTALLIZATION crystallization dependson tdc.taux {
		 t_0: 0.007575757575757576, 0.007575757575757576, 0.25, 0.7348484848484849;
		 t_1: 0.0024752475247524753, 0.3193069306930693, 0.5965346534653465, 0.08168316831683169;
		 t_2: 0.2006172839506173, 0.5462962962962963, 0.15123456790123457, 0.10185185185185185;
		 t_3: 0.7594339622641509, 0.15566037735849056, 0.08018867924528301, 0.0047169811320754715;
		};
	 MELTINGPOINT meltingpoint dependson tdc.taux {
		 t_0: 0.1313131313131313, 0.6161616161616161, 0.25252525252525254;
		 t_1: 0.08250825082508251, 0.7953795379537953, 0.12211221122112212;
		 t_2: 0.3991769547325103, 0.5473251028806585, 0.053497942386831275;
		 t_3: 0.9119496855345912, 0.08176100628930817, 0.006289308176100628;
		};
}
class MECA {
	 TDC tdc;
	 COMPO compo;
	 YOUNGMODULUS youngmodulus dependson compo.ash, compo.cellulose {
		 t_0, t_0: 0.0034364261168384875, 0.8694158075601374, 0.12714776632302402;
		 t_0, t_1: 0.3333333333333333, 0.3333333333333333, 0.3333333333333333;
		 t_0, t_2: 0.14398422090729782, 0.0729783037475345, 0.7830374753451677;
		 t_0, t_3: 0.003058103975535168, 0.1131498470948012, 0.8837920489296637;
		 t_1, t_0: 0.20218579234972678, 0.7923497267759563, 0.00546448087431694;
		 t_1, t_1: 0.0015360983102918587, 0.2780337941628264, 0.7204301075268819;
		 t_1, t_2: 0.7923497267759563, 0.20218579234972678, 0.00546448087431694;
		 t_1, t_3: 0.3333333333333333, 0.3333333333333333, 0.3333333333333333;
		 t_2, t_0: 0.0015360983102918587, 0.33333333333333337, 0.6651305683563749;
		 t_2, t_1: 0.009009009009009009, 0.009009009009009009, 0.9819819819819819;
		 t_2, t_2: 0.3333333333333333, 0.3333333333333333, 0.3333333333333333;
		 t_2, t_3: 0.3333333333333333, 0.3333333333333333, 0.3333333333333333;
		};
	 STRESSATBREAK stressatbreak dependson compo.lignine, compo.ash {
		 t_0, t_0: 0.5281385281385281, 0.46969696969696967, 0.0021645021645021645;
		 t_0, t_1: 0.9926739926739926, 0.003663003663003663, 0.003663003663003663;
		 t_0, t_2: 0.3333333333333333, 0.3333333333333333, 0.3333333333333333;
		 t_1, t_0: 0.3985507246376812, 0.2028985507246377, 0.3985507246376812;
		 t_1, t_1: 0.536723163841808, 0.30790960451977406, 0.1553672316384181;
		 t_1, t_2: 0.16819571865443428, 0.8287461773700305, 0.0030581039755351682;
		 t_2, t_0: 0.8821138211382114, 0.11382113821138211, 0.004065040650406504;
		 t_2, t_1: 0.9855072463768118, 0.007246376811594203, 0.007246376811594203;
		 t_2, t_2: 0.004065040650406504, 0.7723577235772359, 0.22357723577235775;
		};
	 STRAINATBREAK strainatbreak dependson tdc.taux {
		 t_0: 0.007575757575757576, 0.49242424242424243, 0.49242424242424243, 0.007575757575757576;
		 t_1: 0.002, 0.77, 0.162, 0.066;
		 t_2: 0.36235955056179775, 0.45224719101123595, 0.18258426966292135, 0.0028089887640449437;
		 t_3: 0.5746753246753247, 0.262987012987013, 0.10714285714285714, 0.05519480519480519;
		};
}
class PERMEA {
	 H2O h2o {[0.1949685534591195, 0.440251572327044, 0.36477987421383645]};
}
class TGA {
	 TDC tdc;
	 ONSET onset dependson tdc.taux {
		 t_0: 0.0101010101010101, 0.1313131313131313, 0.8585858585858586;
		 t_1: 0.05627705627705627, 0.47186147186147187, 0.47186147186147187;
		 t_2: 0.4149659863945578, 0.5782312925170068, 0.006802721088435374;
		 t_3: 0.8585858585858586, 0.1313131313131313, 0.0101010101010101;
		};
	 DEGRADATION degradation dependson onset {
		 t_0: 0.8333333333333333, 0.08333333333333333, 0.08333333333333333;
		 t_1: 0.44242424242424244, 0.5515151515151515, 0.006060606060606061;
		 t_2: 0.006802721088435374, 0.8027210884353742, 0.1904761904761905;
		};
}

//-------------------------
//     System
//-------------------------


system Ontology{
DSC dsc_0;
GRANULO granulo_0;
COMPO compo_0;
TDC tdc_0;

dsc_0.tdc = tdc_0;
}