Place,Name,Sex,Event,Division,WeightClassKg,Equipment,BirthYear,State,BodyweightKg,Squat1Kg,Squat2Kg,Squat3Kg,Best3SquatKg,Bench1Kg,Bench2Kg,Bench3Kg,Best3BenchKg,Deadlift1Kg,Deadlift2Kg,Deadlift3Kg,Best3DeadliftKg,TotalKg,Age,BirthDate
1,Mark Salandra,M,B,MR-M3,90,Raw,1962,NJ,84,,,,,102.5,107.5,-112.5,107.5,,,,,107.5,,
1,Mackenzie Thumser,F,SBD,FR-Jr,56,Raw,1999,NJ,55.1,95,102.5,105,105,52.5,57.5,-60,57.5,105,117.5,125,125,287.5,,
1,Alonna Gliksman,F,SBD,FR-Jr,60,Raw,2001,NJ,57.3,107.5,117.5,127.5,127.5,72.5,77.5,82.5,82.5,140,147.5,-155,147.5,357.5,,
2,Kaylana LeeChow,F,SBD,FR-Jr,60,Raw,2001,NJ,58.4,125,130,132.5,132.5,72.5,75,-77.5,75,132.5,140,-145,140,347.5,,
1,Julia Skrobacz,F,SBD,FR-Jr,67.5,Raw,1998,NJ,67.3,127.5,132.5,137.5,137.5,67.5,72.5,77.5,77.5,140,150,155,155,370,,
2,Maya Vanderlinden,F,SBD,FR-Jr,67.5,Raw,1999,NJ,65.2,117.5,125,132.5,132.5,67.5,72.5,-77.5,72.5,132.5,140,147.5,147.5,352.5,,
3,Emily Fung,F,SBD,FR-Jr,67.5,Raw,1998,NJ,66.8,105,112.5,120,120,72.5,-77.5,-77.5,72.5,110,122.5,132.5,132.5,325,,
4,Madeline Gehret,F,SBD,FR-Jr,67.5,Raw,1999,NJ,65.2,117.5,-125,-132.5,117.5,62.5,65,-67.5,65,120,127.5,135,135,317.5,,
1,Alison David,F,SBD,FR-Jr,82.5,Raw,2002,NJ,81.1,130,140,150,150,77.5,82.5,85,85,170,180,-190,180,415,,
2,Leah Mai Reilly-Barone,F,SBD,FR-Jr,82.5,Raw,2000,NJ,75.5,85,95,100,100,45,-52.5,-52.5,45,112.5,120,137.5,137.5,282.5,,
1,Jaime Smolenski,F,SBD,FR-M1,48,Raw,1978,NJ,48,65,-72.5,72.5,72.5,32.5,37.5,-40,37.5,80,90,95,95,205,,
1,Jamie Noah,F,SBD,FR-M1,90,Raw,1981,NJ,84.6,152.5,157.5,162.5,162.5,82.5,85,87.5,87.5,157.5,162.5,-167.5,162.5,412.5,,
2,Jessica Rau,F,SBD,FR-M1,90,Raw,1979,NJ,87.6,130,142.5,145,145,72.5,80,85,85,147.5,160,-170,160,390,,
3,Christina Sanclimenti,F,SBD,FR-M1,90,Raw,1976,NJ,87.2,105,117.5,125,125,72.5,80,82.5,82.5,122.5,137.5,150,150,357.5,,
1,Jennifer Flanagan,F,SBD,FR-M1,100,Raw,1982,NJ,96.9,70,-77.5,77.5,77.5,52.5,62.5,-70,62.5,85,95,105,105,245,,
1,Kathryn McNamee,F,SBD,FR-M1,67.5,Raw,1980,NJ,66.6,122.5,130,137.5,137.5,60,62.5,65,65,127.5,137.5,145,145,347.5,,
2,Shara Kaplan,F,SBD,FR-M1,67.5,Raw,1979,NJ,65.6,75,85,87.5,87.5,57.5,62.5,-67.5,62.5,122.5,130,-137.5,130,280,,
1,Donna Aromando,F,SBD,FR-M3,67.5,Raw,1961,NJ,66.8,105,-110,110,110,55,57.5,-60,57.5,135,140,147.5,147.5,315,,
1,Dominique Vo,F,SBD,FR-O,48,Raw,1997,NJ,47,-90,-92.5,92.5,92.5,-52.5,52.5,-55,52.5,-110,110,-115,110,255,,
1,Danielle Riccardella,F,SBD,FR-O,52,Raw,1991,NJ,50.7,82.5,90,95,95,52.5,-55,55,55,110,117.5,125,125,275,,
1,Rachel Orbach,F,SBD,FR-O,56,Raw,1993,NJ,55.3,137.5,145,150,150,80,-85,-85,80,170,-180,-180,170,400,,
2,Dara Grzesh,F,SBD,FR-O,56,Raw,1989,NJ,54.9,-110,-110,110,110,57.5,62.5,67.5,67.5,-135,135,142.5,142.5,320,,
3,Amariah Macatangay,F,SBD,FR-O,56,Raw,1994,NJ,55.7,102.5,110,115,115,62.5,67.5,-70,67.5,117.5,127.5,-132.5,127.5,310,,
4,Kirsten Rose Cuasay,F,SBD,FR-O,56,Raw,1997,NJ,55.9,90,95,100,100,45,50,-55,50,105,115,-125,115,265,,
5,Jazmine Andes,F,SBD,FR-O,56,Raw,1996,NJ,55.2,85,-90,90,90,50,-52.5,-52.5,50,97.5,105,112.5,112.5,252.5,,
6,Heidi Yun,F,SBD,FR-O,56,Raw,1987,NJ,53.9,77.5,87.5,92.5,92.5,40,45,-52.5,45,90,102.5,107.5,107.5,245,,
1,Sophia Gonet,F,SBD,FR-O,60,Raw,1992,NJ,59.4,-115,115,122.5,122.5,65,70,72.5,72.5,160,172.5,182.5,182.5,377.5,,
2,Kaylana LeeChow,F,SBD,FR-O,60,Raw,2001,NJ,58.4,125,130,132.5,132.5,72.5,75,-77.5,75,132.5,140,-145,140,347.5,,
3,Aprille Simpliciano,F,SBD,FR-O,60,Raw,1998,NJ,58.9,85,92.5,95,95,45,47.5,50,50,115,122.5,127.5,127.5,272.5,,
1,Stephanie Chen,F,SBD,FR-O,75,Raw,1997,NJ,73.9,130,137.5,-142.5,137.5,77.5,80,85,85,152.5,162.5,-170,162.5,385,,
1,Jamie Noah,F,SBD,FR-O,90,Raw,1981,NJ,84.6,152.5,157.5,162.5,162.5,82.5,85,87.5,87.5,157.5,162.5,-167.5,162.5,412.5,,
2,Jessica Rau,F,SBD,FR-O,90,Raw,1979,NJ,87.6,130,142.5,145,145,72.5,80,85,85,147.5,160,-170,160,390,,
3,Christina Sanclimenti,F,SBD,FR-O,90,Raw,1976,NJ,87.2,105,117.5,125,125,72.5,80,82.5,82.5,122.5,137.5,150,150,357.5,,
1,Jennifer Flanagan,F,SBD,FR-O,100,Raw,1982,NJ,96.9,70,-77.5,77.5,77.5,52.5,62.5,-70,62.5,85,95,105,105,245,,
1,Danielle Lewis,F,SBD,FR-O,100+,Raw,1993,NJ,109.3,150,160,167.5,167.5,97.5,100,-102.5,100,177.5,190,200,200,467.5,,
2,Maya Hubbs,F,SBD,FR-O,100+,Raw,1997,NJ,112.8,165,175,-180,175,80,85,87.5,87.5,165,177.5,190,190,452.5,,
3,Geraldine Okwuonu,F,SBD,FR-O,100+,Raw,1984,NJ,105,137.5,145,160,160,77.5,-85,85,85,180,192.5,-205,192.5,437.5,,
1,Morgan Rebernik,F,SBD,FR-O,67.5,Raw,1996,NJ,66.3,135,142.5,145,145,75,80,82.5,82.5,170,180,-182.5,180,407.5,,
2,Naomi Kutin,F,SBD,FR-O,67.5,Raw,2001,NJ,64.4,-142.5,142.5,150,150,60,62.5,65,65,162.5,175,-180,175,390,,
3,Francesca Formisano,F,SBD,FR-O,67.5,Raw,1996,NJ,66,125,130,132.5,132.5,67.5,72.5,75,75,150,157.5,162.5,162.5,370,,
4,Marjorie Wang,F,SBD,FR-O,67.5,Raw,1995,NJ,66.9,120,127.5,135,135,-72.5,-72.5,72.5,72.5,152.5,162.5,-165,162.5,370,,
5,Danika De Guzman,F,SBD,FR-O,67.5,Raw,1997,NJ,66.8,125,-135,137.5,137.5,62.5,67.5,70,70,140,155,-170,155,362.5,,
6,Katie Manzano,F,SBD,FR-O,67.5,Raw,1999,NJ,67.4,122.5,132.5,137.5,137.5,65,70,75,75,130,140,150,150,362.5,,
7,Esmeralda Castillo,F,SBD,FR-O,67.5,Raw,1997,NJ,66.7,125,-132.5,-132.5,125,80,85,-90,85,135,145,150,150,360,,
8,Maya Vanderlinden,F,SBD,FR-O,67.5,Raw,1999,NJ,65.2,117.5,125,132.5,132.5,67.5,72.5,-77.5,72.5,132.5,140,147.5,147.5,352.5,,
9,Kathryn McNamee,F,SBD,FR-O,67.5,Raw,1980,NJ,66.6,122.5,130,137.5,137.5,60,62.5,65,65,127.5,137.5,145,145,347.5,,
10,Rea Lynn Pangalangan,F,SBD,FR-O,67.5,Raw,1996,NJ,66.5,105,112.5,122.5,122.5,50,55,60,60,125,135,145,145,327.5,,
11,Brooke DeMaggio,F,SBD,FR-O,67.5,Raw,2004,NJ,64,105,112.5,117.5,117.5,70,72.5,-77.5,72.5,112.5,120,127.5,127.5,317.5,,
12,Gleny Henry,F,SBD,FR-O,67.5,Raw,1983,NJ,66.6,102.5,107.5,112.5,112.5,60,65,67.5,67.5,112.5,120,125,125,305,,
13,Shara Kaplan,F,SBD,FR-O,67.5,Raw,1979,NJ,65.6,75,-85,87.5,87.5,57.5,62.5,-67.5,62.5,122.5,130,-137.5,130,280,,
1,Alison David,F,SBD,FR-O,82.5,Raw,2002,NJ,81.1,130,140,150,150,77.5,82.5,85,85,170,180,-190,180,415,,
2,Leah Mai Reilly-Barone,F,SBD,FR-O,82.5,Raw,2000,NJ,75.5,85,95,100,100,45,-52.5,-52.5,45,112.5,120,137.5,137.5,282.5,,
1,Reese Caffery,F,SBD,FR-T1,48,Raw,2007,NJ,45.9,60,67.5,70,70,22.5,27.5,30,30,67.5,72.5,75,75,175,,
1,Madison Santos,F,SBD,FR-T2,100+,Raw,2006,NJ,104.2,75,80,90,90,40,42.5,-47.5,42.5,125,130,137.5,137.5,270,,
1,Brooke DeMaggio,F,SBD,FR-T2,67.5,Raw,2004,NJ,64,105,112.5,117.5,117.5,70,72.5,-77.5,72.5,112.5,120,127.5,127.5,317.5,,
1,Shae-Lyn Guido,F,SBD,FR-Y3,44,Raw,2009,NJ,43.4,-62.5,65,-72.5,65,35,37.5,40,40,85,87.5,92.5,92.5,197.5,,
1,Samantha Jillson,F,SBD,FR-Y3,52,Raw,2009,NJ,51.1,55,60,-65,60,-35,35,40,40,80,85,92.5,92.5,192.5,,
1,Joe Caliguari,M,SBD,M-M2b,90,Single-ply,1963,NJ,87.8,-175,175,182.5,182.5,160,172.5,-182.5,172.5,182.5,-192.5,195,195,550,,
1,Dongyoung Kim,M,SBD,MR-Jr,60,Raw,2000,NJ,59.9,160,-167.5,-172.5,160,87.5,92.5,-97.5,92.5,175,195,-222.5,195,447.5,,
2,Jay Lance Guevarra,M,SBD,MR-Jr,60,Raw,1999,NJ,58.6,130,135,140,140,95,100,-102.5,100,150,157.5,165,165,405,,
1,Jason Garcia #1,M,SBD,MR-Jr,75,Raw,1999,NJ,73.6,192.5,207.5,220,220,130,137.5,-142.5,137.5,225,240,252.5,252.5,610,,
2,Dominic Iannella,M,SBD,MR-Jr,75,Raw,2002,NJ,73.3,-175,180,187.5,187.5,100,107.5,-112.5,107.5,215,222.5,232.5,232.5,527.5,,
3,Anthony Watters,M,SBD,MR-Jr,75,Raw,2001,NJ,73.6,165,175,185,185,117.5,122.5,127.5,127.5,195,205,215,215,527.5,,
4,Orlando Martinez,M,SBD,MR-Jr,75,Raw,2001,NJ,73.1,162.5,170,177.5,177.5,90,95,97.5,97.5,210,220,230,230,505,,
1,Chase Cumella,M,SBD,MR-Jr,90,Raw,1999,NJ,89.6,210,220,-227.5,220,140,147.5,-155,147.5,255,265,275,275,642.5,,
2,Brandon Kwintner,M,SBD,MR-Jr,90,Raw,1999,NJ,89.1,200,212.5,-220,212.5,130,135,142.5,142.5,257.5,270,-287.5,270,625,,
3,Nicholas Garison,M,SBD,MR-Jr,90,Raw,2001,NJ,88.4,-205,205,-215,205,122.5,132.5,137.5,137.5,215,230,237.5,237.5,580,,
4,Nathaniel Pascua,M,SBD,MR-Jr,90,Raw,2001,NJ,87.9,192.5,-202.5,-202.5,192.5,132.5,137.5,-142.5,137.5,215,222.5,230,230,560,,
5,Samuel Wilson,M,SBD,MR-Jr,90,Raw,2000,NJ,88.7,192.5,202.5,212.5,212.5,87.5,92.5,97.5,97.5,220,230,235,235,545,,
6,Kyle Socha,M,SBD,MR-Jr,90,Raw,2002,NJ,86.3,-170,-170,170,170,-122.5,127.5,-132.5,127.5,-215,222.5,-227.5,222.5,520,,
7,Benjiman Mendelovits,M,SBD,MR-Jr,90,Raw,1999,NJ,88.6,-162.5,162.5,-167.5,162.5,100,105,107.5,107.5,215,227.5,-232.5,227.5,497.5,,
1,Lance London,M,SBD,MR-Jr,100,Raw,2000,NJ,99.1,260,275,280,280,140,150,155,155,302.5,320,325,325,760,,
2,Ryan Nolan,M,SBD,MR-Jr,100,Raw,1998,NJ,98.2,260,275,285,285,165,-172.5,172.5,172.5,-265,282.5,295,295,752.5,,
3,Sam Limbardo,M,SBD,MR-Jr,100,Raw,1999,NJ,96.9,240,252.5,260,260,140,150,157.5,157.5,260,272.5,282.5,282.5,700,,
4,Aaron Harrison,M,SBD,MR-Jr,100,Raw,2002,NJ,96.6,232.5,242.5,250,250,132.5,137.5,140,140,250,265,-272.5,265,655,,
5,Justin Sanders,M,SBD,MR-Jr,100,Raw,1999,NJ,99,170,185,-195,185,132.5,140,-145,140,200,212.5,-222.5,212.5,537.5,,
1,Robert Hill #1,M,SBD,MR-Jr,110,Raw,2000,NJ,104.1,217.5,230,240,240,160,172.5,175,175,247.5,260,272.5,272.5,687.5,,
2,Donato Tassoni,M,SBD,MR-Jr,110,Raw,2001,NJ,108.3,210,222.5,230,230,130,137.5,142.5,142.5,225,237.5,250,250,622.5,,
3,Chris Ayala,M,SBD,MR-Jr,110,Raw,1999,NJ,101.5,212.5,217.5,,217.5,132.5,142.5,-150,142.5,250,260,-267.5,260,620,,
4,Justin Goins,M,SBD,MR-Jr,110,Raw,1999,NJ,106.9,212.5,222.5,-232.5,222.5,140,147.5,152.5,152.5,222.5,232.5,242.5,242.5,617.5,,
1,Tighe Tubito,M,SBD,MR-Jr,125,Raw,2001,NJ,123.4,-220,220,-230,220,142.5,150,155,155,230,247.5,-257.5,247.5,622.5,,
1,Curtis Lam,M,SBD,MR-Jr,67.5,Raw,2000,NJ,67.5,177.5,-185,-185,177.5,97.5,-102.5,-102.5,97.5,212.5,222.5,230,230,505,,
2,Jeffrey Ko,M,SBD,MR-Jr,67.5,Raw,1999,NJ,63,165,172.5,180,180,97.5,102.5,105,105,185,190,195,195,480,,
1,Evan Poust,M,SBD,MR-Jr,82.5,Raw,2001,NJ,81.7,230,232.5,240,240,132.5,137.5,-145,137.5,237.5,247.5,267.5,267.5,645,,
2,James Dorner,M,SBD,MR-Jr,82.5,Raw,2000,NJ,80.4,205,215,220,220,122.5,130,-132.5,130,250,265,-272.5,265,615,,
3,Luis Giler,M,SBD,MR-Jr,82.5,Raw,2000,NJ,81.1,-197.5,197.5,-205,197.5,152.5,160,165,165,215,225,235,235,597.5,,
4,Brian Ruhl,M,SBD,MR-Jr,82.5,Raw,1999,NJ,77.8,210,217.5,-230,217.5,125,130,-137.5,130,220,227.5,237.5,237.5,585,,
5,Eric Altenburg,M,SBD,MR-Jr,82.5,Raw,1999,NJ,76.3,165,177.5,187.5,187.5,107.5,115,120,120,225,240,252.5,252.5,560,,
6,Nicholas Lin,M,SBD,MR-Jr,82.5,Raw,1999,NJ,81.9,190,200,220,220,100,107.5,,107.5,195,215,-227.5,215,542.5,,
7,Russell Johnson #2,M,SBD,MR-Jr,82.5,Raw,2001,NJ,80.8,130,142.5,160,160,95,105,-115,105,160,177.5,190,190,455,,
1,Ryan Donnelly,M,SBD,MR-M1,125,Raw,1982,NJ,111.5,230,250,262.5,262.5,172.5,182.5,187.5,187.5,255,275,280,280,730,,
2,Justin Genovino,M,SBD,MR-M1,125,Raw,1982,NJ,121.9,152.5,160,162.5,162.5,105,112.5,115,115,172.5,185,192.5,192.5,470,,
1,John Lelko,M,SBD,MR-M1,140,Raw,1981,NJ,131.7,242.5,257.5,267.5,267.5,160,170,-175,170,202.5,217.5,-225,217.5,655,,
1,Ryan Erasmus,M,SBD,MR-M1,67.5,Raw,1978,NJ,66.7,170,175,180,180,115,120,-122.5,120,180,187.5,192.5,192.5,492.5,,
1,Peter Severenuk,M,SBD,MR-M2,100,Raw,1964,NJ,97.2,122.5,130,140,140,85,92.5,95,95,150,160,170,170,405,,
1,James Weiss,M,SBD,MR-M3,140,Raw,1962,NJ,126,-215,215,235,235,95,107.5,-115,107.5,230,247.5,255,255,597.5,,
1,Eric Verbel,M,SBD,MR-M2,67.5,Raw,1965,NJ,66.1,-155,155,165,165,82.5,-90,90,90,177.5,187.5,195,195,450,,
1,Ron Falcone,M,SBD,MR-M3,100,Raw,1961,NJ,94.2,150,-160,160,160,107.5,115,-122.5,115,155,167.5,180,180,455,,
1,Zane Pike,M,SBD,MR-O,52,Raw,1997,NJ,51.1,45,-52.5,52.5,52.5,42.5,50,-55,50,100,107.5,110,110,212.5,,
1,Nicholas Oppis,M,SBD,MR-O,56,Raw,1993,NJ,54.2,115,125,132.5,132.5,70,77.5,-82.5,77.5,150,160,-162.5,160,370,,
1,Dongyoung Kim,M,SBD,MR-O,60,Raw,2000,NJ,59.9,160,-167.5,-172.5,160,87.5,92.5,-97.5,92.5,175,195,-222.5,195,447.5,,
2,Jay Lance Guevarra,M,SBD,MR-O,60,Raw,1999,NJ,58.6,130,135,140,140,95,100,-102.5,100,150,157.5,165,165,405,,
1,Joseph Bierly,M,SBD,MR-O,75,Raw,1994,NJ,73.5,-215,215,230,230,137.5,142.5,145,145,275,290,300,300,675,,
2,Ryan Janni,M,SBD,MR-O,75,Raw,1990,NJ,73.2,212.5,217.5,222.5,222.5,155,-160,-160,155,227.5,237.5,247.5,247.5,625,,
3,Aaron Del Mundo,M,SBD,MR-O,75,Raw,1994,NJ,74.2,205,215,222.5,222.5,135,140,145,145,225,240,250,250,617.5,,
4,Johnatan Aragon,M,SBD,MR-O,75,Raw,1997,NJ,74.6,190,205,215,215,117.5,125,130,130,220,-235,235,235,580,,
5,Lambros Koutsfetsoulis,M,SBD,MR-O,75,Raw,2003,NJ,73.9,205,215,222.5,222.5,110,115,117.5,117.5,232.5,-245,-245,232.5,572.5,,
6,Pedro Perez,M,SBD,MR-O,75,Raw,1996,NJ,72.1,-197.5,197.5,-207.5,197.5,130,137.5,-142.5,137.5,222.5,235,-245,235,570,,
7,Joshua Blanco-Giral,M,SBD,MR-O,75,Raw,1995,NJ,74.1,-180,180,192.5,192.5,130,-135,135,135,210,222.5,230,230,557.5,,
8,Juan Huaman,M,SBD,MR-O,75,Raw,1997,NJ,73.8,180,195,-207.5,195,122.5,130,-135,130,210,230,-247.5,230,555,,
9,Stephen Fallon,M,SBD,MR-O,75,Raw,1990,NJ,72.4,167.5,175,182.5,182.5,140,-145,145,145,190,-205,-205,190,517.5,,
10,Orlando Martinez,M,SBD,MR-O,75,Raw,2001,NJ,73.1,162.5,170,177.5,177.5,90,95,97.5,97.5,210,220,230,230,505,,
11,Kurt Macavinta,M,SBD,MR-O,75,Raw,1995,NJ,71.9,147.5,-155,155,155,97.5,102.5,107.5,107.5,205,215,222.5,222.5,485,,
12,Constante Palad Jr,M,SBD,MR-O,75,Raw,1997,NJ,73.7,150,160,-165,160,85,90,92.5,92.5,155,165,-172.5,165,417.5,,
1,Benjamin Bulson,M,SBD,MR-O,90,Raw,1991,NJ,89.2,215,230,-240,230,162.5,170,175,175,245,265,277.5,277.5,682.5,,
2,Ronald Beadling,M,SBD,MR-O,90,Raw,1989,NJ,89.6,255,257.5,,257.5,140,-145,-145,140,245,255,-265,255,652.5,,
3,Chase Cumella,M,SBD,MR-O,90,Raw,1999,NJ,89.6,210,220,-227.5,220,140,147.5,-155,147.5,255,265,275,275,642.5,,
4,Scott Bargisen,M,SBD,MR-O,90,Raw,1996,NJ,89.2,200,217.5,222.5,222.5,150,-165,-165,150,-230,247.5,-255,247.5,620,,
5,Nelson Angelo Villanueva,M,SBD,MR-O,90,Raw,1998,NJ,87.8,210,217.5,225,225,115,120,125,125,220,227.5,235,235,585,,
6,Brandon Hulsart,M,SBD,MR-O,90,Raw,2003,NJ,88.8,172.5,180,195,195,100,110,117.5,117.5,225,240,-250,240,552.5,,
7,Jeffrey Wyckoff,M,SBD,MR-O,90,Raw,1987,NJ,87.1,185,197.5,205,205,107.5,115,120,120,180,192.5,205,205,530,,
8,Nathaniel Aquino,M,SBD,MR-O,90,Raw,1998,NJ,86.5,160,170,185,185,107.5,115,-120,115,195,210,225,225,525,,
9,Joseph Kurlantzick,M,SBD,MR-O,90,Raw,1998,NJ,87.5,162.5,170,177.5,177.5,115,125,127.5,127.5,190,205,215,215,520,,
10,Saif Mohamed,M,SBD,MR-O,90,Raw,1991,NJ,86.4,175,185,-192.5,185,95,100,105,105,210,-220,220,220,510,,
11,Daniel-Peter Adjetey,M,SBD,MR-O,90,Raw,1989,NJ,85.9,132.5,140,145,145,97.5,102.5,105,105,195,207.5,210,210,460,,
12,Christian Bolivar,M,SBD,MR-O,90,Raw,1983,NJ,84.4,117.5,125,130,130,87.5,92.5,100,100,142.5,155,167.5,167.5,397.5,,
1,Lance London,M,SBD,MR-O,100,Raw,2000,NJ,99.1,260,275,280,280,140,150,155,155,302.5,320,325,325,760,,
2,Ryan Nolan,M,SBD,MR-O,100,Raw,1998,NJ,98.2,260,275,285,285,165,-172.5,172.5,172.5,-265,282.5,295,295,752.5,,
3,Jake Limbardo,M,SBD,MR-O,100,Raw,1996,NJ,98.6,252.5,-267.5,267.5,267.5,160,170,177.5,177.5,277.5,292.5,297.5,297.5,742.5,,
4,Alexander Ju,M,SBD,MR-O,100,Raw,1986,NJ,97.7,-255,262.5,270,270,167.5,172.5,175,175,277.5,-295,-295,277.5,722.5,,
5,Erik Weiss,M,SBD,MR-O,100,Raw,1995,NJ,98.1,237.5,247.5,252.5,252.5,155,165,-170,165,252.5,265,-272.5,265,682.5,,
6,Jeffrey Donnelly,M,SBD,MR-O,100,Raw,1986,NJ,98.6,207.5,222.5,227.5,227.5,160,170,175,175,227.5,242.5,255,255,657.5,,
7,Paolo Hinahon,M,SBD,MR-O,100,Raw,1997,NJ,98,220,227.5,-232.5,227.5,115,120,125,125,227.5,237.5,250,250,602.5,,
8,Jacob Meiskin,M,SBD,MR-O,100,Raw,1998,NJ,94.3,210,220,227.5,227.5,122.5,130,-132.5,130,207.5,217.5,227.5,227.5,585,,
1,Mike Tedesco,M,SBD,MR-O,110,Raw,2003,NJ,106.9,267.5,275,-287.5,275,147.5,152.5,-160,152.5,277.5,287.5,297.5,297.5,725,,
2,Robert Hill #1,M,SBD,MR-O,110,Raw,2000,NJ,104.1,217.5,230,240,240,160,172.5,175,175,247.5,260,272.5,272.5,687.5,,
1,Ryan Donnelly,M,SBD,MR-O,125,Raw,1982,NJ,111.5,230,250,262.5,262.5,172.5,182.5,187.5,187.5,255,275,280,280,730,,
2,Brandon Win,M,SBD,MR-O,125,Raw,1993,NJ,117.7,195,210,220,220,-115,115,125,125,255,-275,-275,255,600,,
DQ,Anthony Gargiulo,M,SBD,MR-O,125,Raw,1984,NJ,113.2,275,285,292.5,292.5,-175,-182.5,-182.5,,330,342.5,-355,342.5,,,
1,John Lelko,M,SBD,MR-O,140,Raw,1981,NJ,131.7,242.5,257.5,267.5,267.5,160,170,-175,170,202.5,217.5,-225,217.5,655,,
2,James Weiss,M,SBD,MR-O,140,Raw,1962,NJ,126,-215,215,235,235,95,107.5,-115,107.5,230,247.5,255,255,597.5,,
1,Tim Jones,M,SBD,MR-O,140+,Raw,1987,NJ,151.7,162.5,175,-185,175,102.5,107.5,-115,107.5,185,190,195,195,477.5,,
1,Ray Baet,M,SBD,MR-O,67.5,Raw,1993,NJ,66.6,175,-185,-187.5,175,127.5,132.5,137.5,137.5,205,217.5,225,225,537.5,,
2,Arnold Majano,M,SBD,MR-O,67.5,Raw,1995,NJ,65.7,170,180,185,185,135,142.5,147.5,147.5,185,197.5,-205,197.5,530,,
3,Ryan Erasmus,M,SBD,MR-O,67.5,Raw,1978,NJ,66.7,170,175,180,180,115,120,-122.5,120,180,187.5,192.5,192.5,492.5,,
4,Irvin Fuentes,M,SBD,MR-O,67.5,Raw,1995,NJ,63.3,145,155,162.5,162.5,-110,110,112.5,112.5,177.5,192.5,205,205,480,,
1,Max Heller,M,SBD,MR-O,82.5,Raw,2003,NJ,81.9,215,230,237.5,237.5,140,147.5,155,155,245,260,270,270,662.5,,
2,Kristian Elvina,M,SBD,MR-O,82.5,Raw,1985,NJ,82,212.5,220,-227.5,220,150,155,160,160,260,272.5,-277.5,272.5,652.5,,
3,Evan Poust,M,SBD,MR-O,82.5,Raw,2001,NJ,81.7,230,232.5,240,240,132.5,137.5,-145,137.5,237.5,247.5,267.5,267.5,645,,
4,Eric Altenburg,M,SBD,MR-O,82.5,Raw,1999,NJ,76.3,165,177.5,187.5,187.5,107.5,115,120,120,225,240,252.5,252.5,560,,
5,Joseph Ballesteros,M,SBD,MR-O,82.5,Raw,1997,NJ,81,155,165,170,170,130,137.5,145,145,197.5,207.5,215,215,530,,
6,Jonathan Castillo,M,SBD,MR-O,82.5,Raw,1988,NJ,81.4,165,177.5,182.5,182.5,115,120,-125,120,210,222.5,-232.5,222.5,525,,
7,Adam Garcia #3,M,SBD,MR-O,82.5,Raw,1984,NJ,80.5,125,130,137.5,137.5,82.5,87.5,-90,87.5,142.5,152.5,160,160,385,,
1,Avery Rubano,M,SBD,MR-T1,67.5,Raw,2008,NJ,65.5,130,137.5,-145,137.5,90,95,-100,95,140,147.5,152.5,152.5,385,,
1,Jayden Martinez,M,SBD,MR-T2,100,Raw,2005,NJ,96.6,172.5,182.5,187.5,187.5,97.5,102.5,-105,102.5,215,-227.5,-227.5,215,505,,
1,Kyle Ramirez,M,SBD,MR-T2,82.5,Raw,2005,NJ,81.2,197.5,207.5,220,220,102.5,110,-115,110,217.5,-230,230,230,560,,
2,Darean Rowland,M,SBD,MR-T2,82.5,Raw,2005,NJ,79.5,155,170,182.5,182.5,102.5,107.5,117.5,117.5,182.5,195,215,215,515,,
3,Jose Cruz,M,SBD,MR-T2,82.5,Raw,2004,NJ,80.1,-170,170,-182.5,170,100,107.5,112.5,112.5,175,190,-202.5,190,472.5,,
1,Raul Restrepo,M,SBD,MR-T3,60,Raw,2003,NJ,58.6,130,142.5,150,150,80,87.5,92.5,92.5,-182.5,192.5,-205,192.5,435,,
DQ,Jose Ramirez #22,M,SBD,MR-T3,60,Raw,2002,NJ,59.5,-175,-180,180,180,-117.5,-117.5,-117.5,,202.5,217.5,-220,217.5,,,
1,Lambros Koutsfetsoulis,M,SBD,MR-T3,75,Raw,2003,NJ,73.9,205,215,222.5,222.5,110,115,117.5,117.5,232.5,-245,-245,232.5,572.5,,
2,Mohamed Moustafa,M,SBD,MR-T3,75,Raw,2004,NJ,72.7,145,-150,155,155,80,85,90,90,180,185,192.5,192.5,437.5,,
3,Nathaniel Bischoff,M,SBD,MR-T3,75,Raw,2003,NJ,74.2,132.5,140,-150,140,85,90,92.5,92.5,160,170,-182.5,170,402.5,,
1,Atilla Turan,M,SBD,MR-T3,90,Raw,2002,NJ,87.7,225,237.5,-250,237.5,150,157.5,162.5,162.5,257.5,275,285,285,685,,
2,Brandon Hulsart,M,SBD,MR-T3,90,Raw,2003,NJ,88.8,172.5,180,195,195,100,110,117.5,117.5,225,240,-250,240,552.5,,
3,Liam Paulino,M,SBD,MR-T3,90,Raw,2002,NJ,88.4,180,187.5,-195,187.5,-122.5,122.5,125,125,200,-215,220,220,532.5,,
1,Mike Tedesco,M,SBD,MR-T3,110,Raw,2003,NJ,106.9,267.5,275,-287.5,275,147.5,152.5,-160,152.5,277.5,287.5,297.5,297.5,725,,
1,Mason Heck,M,SBD,MR-T3,67.5,Raw,2004,NJ,66.8,135,142.5,150,150,95,100,-102.5,100,175,185,195,195,445,,
2,Kellen Bischoff,M,SBD,MR-T3,67.5,Raw,2003,NJ,61.3,95,102.5,-107.5,102.5,62.5,67.5,-72.5,67.5,137.5,-145,-145,137.5,307.5,,
1,Max Heller,M,SBD,MR-T3,82.5,Raw,2003,NJ,81.9,215,230,237.5,237.5,140,147.5,155,155,245,260,270,270,662.5,,
1,Landon Caffery,M,SBD,MR-Y2,40,Raw,2010,NJ,40,60,-70.5,70.5,70.5,32.5,38,-40,38,55,60,62.5,62.5,171,,
1,Killian Coluccio,M,SBD,MR-Y3,48,Raw,2008,NJ,47.2,65,67.5,72.5,72.5,47.5,52.5,55,55,82.5,92.5,102.5,102.5,230,,
1,Chase Deren,M,SBD,MR-Y3,56,Raw,2008,NJ,52.3,67.5,72.5,75,75,40,42.5,45,45,90,95,102.5,102.5,222.5,,
1,Siddhanth Ganesh,M,SBD,MR-Y3,60,Raw,2008,NJ,59.1,60,65,70,70,40,45,47.5,47.5,82.5,87.5,92.5,92.5,210,,
1,Levi Foote,M,SBD,MR-Y3,75,Raw,2008,NJ,72.8,132.5,142.5,-150,142.5,85,90,-95,90,147.5,155,165,165,397.5,,
1,Carter Smith,M,SBD,MR-Y3,125,Raw,2009,NJ,123,160,170,182.5,182.5,95,102.5,-107.5,102.5,-180,180,190,190,475,,
1,Alex Buckbee,M,SBD,M-T1,75,Single-ply,2006,NJ,71.9,147.5,157.5,-167.5,157.5,90,95,100,100,155,165,172.5,172.5,430,,
2,Sean Dupnak,M,SBD,M-T1,75,Single-ply,2007,NJ,72.6,130,137.5,-147.5,137.5,80,85,-90,85,140,147.5,155,155,377.5,,
3,Keegan Foote,M,SBD,M-T1,75,Single-ply,2006,NJ,70,105,110,115,115,77.5,82.5,-87.5,82.5,145,152.5,160,160,357.5,,
4,Richie Flores,M,SBD,M-T1,75,Single-ply,2006,NJ,71.5,102.5,110,115,115,62.5,65,70,70,135,142.5,150,150,335,,
