Place,Name,Sex,BirthDate,Age,Equipment,Division,BodyweightKg,WeightClassKg,Squat1Kg,Squat2Kg,Squat3Kg,Best3SquatKg,Bench1Kg,Bench2Kg,Bench3Kg,Best3BenchKg,Deadlift1Kg,Deadlift2Kg,Deadlift3Kg,Best3DeadliftKg,TotalKg,Event
1,Marc Algaza Molina,M,1995-07-21,27,Raw,SNR,80,82.5,285,295,300,300,162.5,170,172.5,172.5,275,-285,285,285,757.5,SBD
2,Jordi Lopez Saez,M,1997-01-18,26,Raw,SNR,104.6,110,270,280,-285,280,145,150,-155,150,275,285,-292.5,285,715,SBD
3,Antonio Ruiz Amate,M,1989-10-24,33,Raw,SNR,66.2,67.5,185,195,202.5,202.5,90,97.5,102.5,102.5,200,212.5,-217.5,212.5,517.5,SBD
4,Vicente Picazo Montesdeoca,M,1984-08-30,38,Raw,SNR,90,90,245,-257.5,-257.5,245,137.5,145,-150,145,225,237,242.5,242.5,632.5,SBD
5,Pol Pleguezeulos,M,2006-03-14,17,Raw,SJNR,98,100,160,170,-180,170,80,82.5,85,85,170,180,185,185,440,SBD
1,Daniel Maroñas Mourelos,M,1988-04-24,35,Raw,SNR,85.6,90,,,,,187.5,-192.5,-192.5,187.5,,,,,187.5,B
2,Marc Algaza Molina,M,1995-07-21,27,Raw,SNR,80,82.5,,,,,162.5,170,172.5,172.5,,,,,172.5,B
3,Juan Plazas,M,1980-04-12,43,Raw,M1,80.9,82.5,,,,,155,-162.5,,155,,,,,155,B
4,David Caro,M,1980-05-13,43,Raw,M1,97.2,100,,,,,120,122.5,125,125,,,,,125,B
1,Marc Algaza Molina,M,1995-07-21,27,Raw,SNR,80,82.5,,,,,,,,,275,-285,285,285,285,D
2,David Jiménez Prol,M,1974-04-15,49,Raw,M2,109.5,110,,,,,,,,,267.5,280,,280,280,D
3,Ricard Vila Canals,M,1989-06-11,34,Raw,SNR,89.1,90,,,,,,,,,245,-260,-267.5,245,245,D
4,Kilian Alba,M,2003-12-14,19,Raw,SJNR,81.1,82.5,,,,,,,,,200,210,220,220,220,D