Place,Name,Sex,BirthDate,Age,Equipment,Division,BodyweightKg,WeightClassKg,Squat1Kg,Squat2Kg,Squat3Kg,Squat4Kg,Best3SquatKg,Bench1Kg,Bench2Kg,Bench3Kg,Bench4Kg,Best3BenchKg,Deadlift1Kg,Deadlift2Kg,Deadlift3Kg,Deadlift4Kg,Best3DeadliftKg,TotalKg,Event
1,Stacey Palmer,F,2002-12-08,20,Wraps,F-JR,78,82.5,137.5,143.5,148.5,152.5,148.5,55,60,-67.5,,60,140,150,157.5,,157.5,366,SBD
1,Alice Rosier,F,1981-03-21,42,Wraps,F-M1R,50.7,52,115,-125,127.5,,127.5,40,45,,,45,110,120,-130,-130,120,292.5,SBD
1,Mere Joyce Munu,F,1981-09-10,41,Wraps,F-M1R,84.6,90,110,120,130,,130,60,-65,-65,,60,145,150,-157.5,,150,340,SBD
1,Amanda Berry,F,1978-04-19,45,Wraps,F-M2R,128.2,110+,67.5,75,77.5,,77.5,67.5,75,80,85,80,117.5,122.5,130,140,130,287.5,SBD
1,Gay Hale,F,1953-10-01,69,Wraps,F-M6R,71.1,75,-100,-100,100,,100,40,-45,45,,45,100,105,110,,110,255,SBD
1,Julia Vanhoorne,F,1985-11-22,37,Wraps,F-OR,54.7,56,105,110,112.5,,112.5,70,75,-77.5,,75,125,135,142.5,,142.5,330,SBD
1,Irene Fages,F,1992-09-22,30,Wraps,F-OR,64.9,67.5,87.5,-92.5,92.5,,92.5,42.5,47.5,-52.5,,47.5,95,105,115,,115,255,SBD
1,Rebecca Haywood,F,1997-05-15,26,Wraps,F-OR,74.1,75,147.5,155,,,155,80,90,-100,,90,130,140,-155,,140,385,SBD
2,Liv Ford,F,1995-12-22,27,Wraps,F-OR,72.6,75,122.5,130,135,,135,72.5,75,-77.5,,75,137.5,145,152.5,,152.5,362.5,SBD
1,Jaime Canton,F,1991-06-18,32,Wraps,F-OR,80.9,82.5,145,155,160,,160,82.5,87.5,-90,,87.5,175,185,197.5,,197.5,445,SBD
2,Angela Perkin,F,1987-02-22,36,Wraps,F-OR,81.1,82.5,130,142.5,,,142.5,77.5,-82.5,82.5,,82.5,130,142.5,-150,,142.5,367.5,SBD
3,Brooke Pita,F,1991-04-22,32,Wraps,F-OR,80.4,82.5,100,105,110,,110,60,62.5,-65,,62.5,135,140,145,,145,317.5,SBD
1,Melissa Ramos #1,F,1997-05-07,26,Wraps,F-OR,87.7,90,132.5,137.5,140,,140,87.5,-90,90,,90,145,150,-155,,150,380,SBD
1,Tyler Draper,F,1995-10-12,27,Wraps,F-OR,91.9,100,145,150,-155,,150,75,80,82.5,,82.5,160,170,-172.5,,170,402.5,SBD
2,Abba Samman,F,1993-02-25,30,Wraps,F-OR,93.4,100,135,145,,,145,60,75,,,75,140,150,170,,170,390,SBD
3,Lesley Hames,F,1984-12-12,38,Wraps,F-OR,90.8,100,137.5,145,150.5,,150.5,55,60,65,,65,155,162.5,170,175,170,385.5,SBD
DQ,Naiomi Randall,F,1995-06-27,28,Wraps,F-OR,105,110,-125,-125,-125,,,70,77.5,-80,,77.5,145,152.5,-160,,152.5,,SBD
1,Indiana Shields,F,2006-10-04,16,Wraps,F-T2R,85.6,90,110,-115,-115,,110,55,60,65,70,65,120,130,140,-145,140,315,SBD
1,Marley Martin,F,2006-01-28,17,Wraps,F-T2R,99.9,100,135,145,150,,150,50,60,-65,,60,165,177.5,190,,190,400,SBD
1,Jo Wemyss,F,1974-04-09,49,Single-ply,F-M2E,72.2,75,120,-125,125,,125,-62.5,-62.5,62.5,,62.5,135,145,150,-152.5,150,337.5,SBD
1,Adrienne Prentis-Pirere,F,1962-04-08,61,Multi-ply,F-M5E,87.2,90,57.5,67.5,77.5,82.5,77.5,77.5,82.5,87.5,-90,87.5,100,105,110,,110,275,SBD
1,Tyllah-Rose Rogers,F,2002-11-08,20,Wraps,F-JR,123.2,110+,120,127.5,130,-132.5,130,,,,,,,,,,,130,S
1,Sharnae Rowland,F,1998-09-13,24,Wraps,F-OR,65.9,67.5,135,-140,140,142.5,140,,,,,,,,,,,140,S
1,Danielle Maurice,F,1984-05-17,39,Wraps,F-OR,76.3,82.5,100,110,-125,-125,110,,,,,,,,,,,110,S
1,Jolene Waugh,F,1982-01-12,41,Raw,F-M1R,134.1,110+,,,,,,77.5,85,90,-92.5,90,,,,,,90,B
1,Pat Buxton,F,1983-10-05,39,Raw,F-OR,94.4,100,,,,,,72.5,76,80,-85,80,,,,,,80,B
1,Laurie Williams,F,1988-03-10,35,Raw,F-OR,109.8,110,,,,,,-55,55,67.5,,67.5,,,,,,67.5,B
1,Tyllah-Rose Rogers,F,2002-11-08,20,Raw,F-JR,123.2,110+,,,,,,,,,,,130,137.5,145,150,145,145,D
1,Pat Buxton,F,1983-10-05,39,Raw,F-OR,94.4,100,,,,,,,,,,,135,140,145,147.5,145,145,D
1,Steve France,M,1981-02-13,42,Wraps,M-M1R,80.8,82.5,152.5,160,-170,,160,92.5,97.5,-100,,97.5,185,195,-202.5,,195,452.5,SBD
1,James Joyce #1,M,1969-10-02,53,Wraps,M-M3R,89.9,90,135,145,-155,,145,97.5,102.5,-107.5,,102.5,185,197.5,,,197.5,445,SBD
1,Tom Carroll,M,1994-07-28,29,Wraps,M-OR,87.3,90,170,180,190,,190,125,-132.5,-137.5,,125,225,230,-235,,230,545,SBD
2,Jordan Poate,M,1994-11-04,28,Wraps,M-OR,87.5,90,152.5,-162.5,170,,170,115,125,-130,,125,197.5,215,227.5,,227.5,522.5,SBD
1,Sam Lees,M,1993-06-15,30,Wraps,M-OR,99.7,100,285,300.5,315,,315,145,152.5,155,,155,-285,-285,285,,285,755,SBD
2,Michael Fernandes #1,M,1998-09-08,24,Wraps,M-OR,92.5,100,220,,,,220,130,140,-150,,140,240,255,270,,270,630,SBD
3,Dave Jordan,M,1986-10-14,36,Wraps,M-OR,92.6,100,200,-210,220,,220,-140,-145,150,,150,210,220,-230,,220,590,SBD
4,Sean Hart,M,1996-09-24,26,Wraps,M-OR,97.4,100,190,197.5,207.5,,207.5,132.5,137.5,142.5,,142.5,205,217.5,227.5,,227.5,577.5,SBD
5,Michael Vermunt,M,1994-01-29,29,Wraps,M-OR,99.8,100,187.5,195,-200,,195,125,130,-135,,130,207.5,217.5,-225,,217.5,542.5,SBD
6,Jordan Symes,M,1996-06-01,27,Wraps,M-OR,92.3,100,-147.5,-147.5,150,,150,102.5,-105,-105,,102.5,215,-230,-230,,215,467.5,SBD
1,Cyril Heywood,M,1990-09-14,32,Wraps,M-OR,123.7,125,280,300,310,,310,160,180,200,,200,300,340,,,340,850,SBD
2,Richard De Reeper,M,1998-04-16,25,Wraps,M-OR,120.2,125,230,252.5,,,252.5,180,190,,,190,300,,,,300,742.5,SBD
3,Jack Atwood,M,,27,Wraps,M-OR,117.2,125,220,230,235,,235,170,175,-180,,175,260,267.5,272.5,,272.5,682.5,SBD
1,Wade McLean-Te Hui,M,1994-06-28,29,Wraps,M-OR,173.3,140+,220,,,,220,180,200,,,200,280,,,,280,700,SBD
1,Riley Neal,M,2007-10-03,15,Wraps,M-T1R,74.2,75,125,-130,130,138,130,60,65,-70,,65,140,150,-155,,150,345,SBD
DQ,James Kong,M,2004-07-25,19,Wraps,M-T3R,72.9,75,-150,150,-152.5,,150,-102.5,-102.5,-102.5,,,207.5,215,-227.5,,215,,SBD
1,Cyrus Bien Tumalivan,M,2004-12-03,18,Wraps,M-T3R,75.1,82.5,160,170,180,,180,-95,-95,95,,95,180,190,200,,200,475,SBD
1,David Mohn,M,1979-05-11,44,Single-ply,M-M1E,108.5,110,265,280,-302.5,,280,-150,155,,,155,247.5,265,277.5,-290,277.5,712.5,SBD
1,James Papesch,M,1985-11-28,37,Single-ply,M-OE,107.6,110,255,265,,,265,170,,,,170,200,222.5,,,222.5,657.5,SBD
1,Liam Blackford,M,,15,Raw,M-T1R,82.3,82.5,,,,,,-72.5,-75,75,-85,75,,,,,,75,B
1,Mad Mike Smith,M,,48,Raw,M-M2R,81.7,82.5,,,,,,,,,,,230,241,250,,250,250,D
