2652565.00
N35699215
До 100м3/сут
0.864950
До 6.3 МПа
На нефть, газ и воду
ROXAR, AGAR, FMC
До 14
До 35 лет с момента изготовления
До 60 месяцев с момента установки
От 80 до 150 календарных дней
05.07.2017 г.
Oil Tech
6386.00
03.04.2016 г.
05.10.2016 г.
125000.00
1561.13
3250.00
745.00
1
 
 
 
 