%YAML 1.1
%TAG !u! tag:unity3d.com,2011:
--- !u!1045 &1
EditorBuildSettings:
  m_ObjectHideFlags: 0
  serializedVersion: 2
  m_Scenes:
  - enabled: 1
    path: Assets/Scenes/MenuScene.unity
    guid: 7112073e94471424abdf7f233105b3fd
  - enabled: 1
    path: Assets/Scenes/MU.unity
    guid: 06ead38237d10f149a69283e21c7d6b6
  - enabled: 1
    path: Assets/Scenes/GU.unity
    guid: 7aa35de4e5abef7458dc52beea9732df
  - enabled: 1
    path: Assets/Scenes/UPSV.unity
    guid: 55f51b490e8e4fc49b45cc3c04925829
  m_configObjects: {}
