{
	"artifacts" : 
	[
		{
			"path" : "CMakeFiles/BSP_p.utilities.misc_utilities.MIMXRT1061.dir/./C_/Users/MeichiMC_Wang/source/repos/SDK_2_13_0_MIMXRT1061xxxxA/devices/MIMXRT1061/utilities/fsl_sbrk.c.obj"
		},
		{
			"path" : "CMakeFiles/BSP_p.utilities.misc_utilities.MIMXRT1061.dir/./a862b80d87169a356d58d0274e2fc677/SDK_2_13_0_MIMXRT1061xxxxA/devices/MIMXRT1061/utilities/fsl_memcpy.S.obj"
		}
	],
	"backtrace" : 5,
	"backtraceGraph" : 
	{
		"commands" : 
		[
			"add_library",
			"create_bsp_library",
			"create_bsp_framework_library_from_vars",
			"visualgdb_bsp_instantiate_referenced_frameworks",
			"find_bsp",
			"target_link_libraries",
			"set_property",
			"copy_property_if_not_defined"
		],
		"files" : 
		[
			"C:/Program Files (x86)/Sysprogs/VisualGDB/CMake/embedded/bsp.cmake",
			"C:/Program Files (x86)/Sysprogs/VisualGDB/CMake/embedded/efp.cmake",
			"C:/Users/MeichiMC_Wang/source/repos/SDK_2_13_0_MIMXRT1061xxxxA/bsp.cmake",
			"CMakeLists.txt"
		],
		"nodes" : 
		[
			{
				"file" : 3
			},
			{
				"command" : 4,
				"file" : 3,
				"line" : 5,
				"parent" : 0
			},
			{
				"command" : 3,
				"file" : 0,
				"line" : 379,
				"parent" : 1
			},
			{
				"command" : 2,
				"file" : 2,
				"line" : 4691,
				"parent" : 2
			},
			{
				"command" : 1,
				"file" : 1,
				"line" : 13,
				"parent" : 3
			},
			{
				"command" : 0,
				"file" : 0,
				"line" : 43,
				"parent" : 4
			},
			{
				"command" : 5,
				"file" : 1,
				"line" : 37,
				"parent" : 3
			},
			{
				"command" : 7,
				"file" : 0,
				"line" : 395,
				"parent" : 1
			},
			{
				"command" : 6,
				"file" : 0,
				"line" : 57,
				"parent" : 7
			}
		]
	},
	"compileGroups" : 
	[
		{
			"compileCommandFragments" : 
			[
				{
					"fragment" : "-g3 -O0"
				},
				{
					"backtrace" : 6,
					"fragment" : "-mcpu=cortex-m7"
				},
				{
					"backtrace" : 6,
					"fragment" : "-mthumb"
				},
				{
					"backtrace" : 6,
					"fragment" : "-mfpu=fpv5-sp-d16"
				},
				{
					"backtrace" : 6,
					"fragment" : "-mfloat-abi=hard"
				},
				{
					"backtrace" : 6,
					"fragment" : "-ffunction-sections"
				},
				{
					"backtrace" : 6,
					"fragment" : "-fdata-sections"
				},
				{
					"fragment" : "-std=c99"
				}
			],
			"defines" : 
			[
				{
					"backtrace" : 6,
					"define" : "ARM_MATH_CM7"
				},
				{
					"backtrace" : 6,
					"define" : "CPU_MIMXRT1061CVL5A"
				},
				{
					"backtrace" : 6,
					"define" : "CPU_MIMXRT1061CVL5A_cm7"
				},
				{
					"backtrace" : 6,
					"define" : "CPU_MIMXRT1062DVL6A"
				},
				{
					"backtrace" : 6,
					"define" : "DEBUG=1"
				},
				{
					"backtrace" : 6,
					"define" : "MCUXPRESSO_SDK"
				},
				{
					"backtrace" : 6,
					"define" : "SDK_DEBUGCONSOLE=1"
				},
				{
					"backtrace" : 6,
					"define" : "XIP_BOOT_HEADER_ENABLE=1"
				},
				{
					"backtrace" : 6,
					"define" : "XIP_EXTERNAL_FLASH=1"
				}
			],
			"includes" : 
			[
				{
					"backtrace" : 6,
					"path" : "C:/Users/MeichiMC_Wang/source/repos/SDK_2_13_0_MIMXRT1061xxxxA/CMSIS/Core/Include"
				},
				{
					"backtrace" : 6,
					"path" : "C:/Users/MeichiMC_Wang/source/repos/SDK_2_13_0_MIMXRT1061xxxxA/components/lists"
				},
				{
					"backtrace" : 6,
					"path" : "C:/Users/MeichiMC_Wang/source/repos/SDK_2_13_0_MIMXRT1061xxxxA/components/uart"
				},
				{
					"backtrace" : 6,
					"path" : "C:/Users/MeichiMC_Wang/source/repos/SDK_2_13_0_MIMXRT1061xxxxA/devices/MIMXRT1061"
				},
				{
					"backtrace" : 6,
					"path" : "C:/Users/MeichiMC_Wang/source/repos/SDK_2_13_0_MIMXRT1061xxxxA/devices/MIMXRT1061/drivers"
				},
				{
					"backtrace" : 6,
					"path" : "C:/Users/MeichiMC_Wang/source/repos/SDK_2_13_0_MIMXRT1061xxxxA/devices/MIMXRT1061/utilities/str"
				},
				{
					"backtrace" : 6,
					"path" : "C:/Users/MeichiMC_Wang/source/repos/SDK_2_13_0_MIMXRT1061xxxxA/devices/MIMXRT1061/utilities/debug_console_lite"
				},
				{
					"backtrace" : 6,
					"path" : "C:/Users/MeichiMC_Wang/source/repos/IMXRT1061_FLASH/."
				}
			],
			"language" : "C",
			"languageStandard" : 
			{
				"backtraces" : 
				[
					8
				],
				"standard" : "99"
			},
			"sourceIndexes" : 
			[
				0
			]
		},
		{
			"compileCommandFragments" : 
			[
				{
					"fragment" : "-g"
				},
				{
					"backtrace" : 6,
					"fragment" : "-mcpu=cortex-m7"
				},
				{
					"backtrace" : 6,
					"fragment" : "-mthumb"
				},
				{
					"backtrace" : 6,
					"fragment" : "-mfpu=fpv5-sp-d16"
				},
				{
					"backtrace" : 6,
					"fragment" : "-mfloat-abi=hard"
				},
				{
					"backtrace" : 6,
					"fragment" : "-ffunction-sections"
				},
				{
					"backtrace" : 6,
					"fragment" : "-fdata-sections"
				}
			],
			"defines" : 
			[
				{
					"backtrace" : 6,
					"define" : "ARM_MATH_CM7"
				},
				{
					"backtrace" : 6,
					"define" : "CPU_MIMXRT1061CVL5A"
				},
				{
					"backtrace" : 6,
					"define" : "CPU_MIMXRT1061CVL5A_cm7"
				},
				{
					"backtrace" : 6,
					"define" : "CPU_MIMXRT1062DVL6A"
				},
				{
					"backtrace" : 6,
					"define" : "DEBUG=1"
				},
				{
					"backtrace" : 6,
					"define" : "MCUXPRESSO_SDK"
				},
				{
					"backtrace" : 6,
					"define" : "SDK_DEBUGCONSOLE=1"
				},
				{
					"backtrace" : 6,
					"define" : "XIP_BOOT_HEADER_ENABLE=1"
				},
				{
					"backtrace" : 6,
					"define" : "XIP_EXTERNAL_FLASH=1"
				}
			],
			"includes" : 
			[
				{
					"backtrace" : 6,
					"path" : "C:/Users/MeichiMC_Wang/source/repos/SDK_2_13_0_MIMXRT1061xxxxA/CMSIS/Core/Include"
				},
				{
					"backtrace" : 6,
					"path" : "C:/Users/MeichiMC_Wang/source/repos/SDK_2_13_0_MIMXRT1061xxxxA/components/lists"
				},
				{
					"backtrace" : 6,
					"path" : "C:/Users/MeichiMC_Wang/source/repos/SDK_2_13_0_MIMXRT1061xxxxA/components/uart"
				},
				{
					"backtrace" : 6,
					"path" : "C:/Users/MeichiMC_Wang/source/repos/SDK_2_13_0_MIMXRT1061xxxxA/devices/MIMXRT1061"
				},
				{
					"backtrace" : 6,
					"path" : "C:/Users/MeichiMC_Wang/source/repos/SDK_2_13_0_MIMXRT1061xxxxA/devices/MIMXRT1061/drivers"
				},
				{
					"backtrace" : 6,
					"path" : "C:/Users/MeichiMC_Wang/source/repos/SDK_2_13_0_MIMXRT1061xxxxA/devices/MIMXRT1061/utilities/str"
				},
				{
					"backtrace" : 6,
					"path" : "C:/Users/MeichiMC_Wang/source/repos/SDK_2_13_0_MIMXRT1061xxxxA/devices/MIMXRT1061/utilities/debug_console_lite"
				},
				{
					"backtrace" : 6,
					"path" : "C:/Users/MeichiMC_Wang/source/repos/IMXRT1061_FLASH/."
				}
			],
			"language" : "ASM",
			"sourceIndexes" : 
			[
				1
			]
		}
	],
	"dependencies" : 
	[
		{
			"backtrace" : 6,
			"id" : "BSP::@6890427a1f51a3e7e1df"
		}
	],
	"id" : "BSP_p.utilities.misc_utilities.MIMXRT1061::@6890427a1f51a3e7e1df",
	"name" : "BSP_p.utilities.misc_utilities.MIMXRT1061",
	"paths" : 
	{
		"build" : ".",
		"source" : "."
	},
	"sourceGroups" : 
	[
		{
			"name" : "Source Files",
			"sourceIndexes" : 
			[
				0
			]
		},
		{
			"name" : "",
			"sourceIndexes" : 
			[
				1
			]
		},
		{
			"name" : "Object Libraries",
			"sourceIndexes" : 
			[
				2
			]
		}
	],
	"sources" : 
	[
		{
			"backtrace" : 5,
			"compileGroupIndex" : 0,
			"path" : "C:/Users/MeichiMC_Wang/source/repos/SDK_2_13_0_MIMXRT1061xxxxA/devices/MIMXRT1061/utilities/fsl_sbrk.c",
			"sourceGroupIndex" : 0
		},
		{
			"backtrace" : 5,
			"compileGroupIndex" : 1,
			"path" : "C:/Users/MeichiMC_Wang/source/repos/SDK_2_13_0_MIMXRT1061xxxxA/devices/MIMXRT1061/utilities/fsl_memcpy.S",
			"sourceGroupIndex" : 1
		},
		{
			"backtrace" : 6,
			"isGenerated" : true,
			"path" : "build/VisualGDB/Debug/CMakeFiles/BSP.dir/C_/Program_Files_(x86)/Sysprogs/VisualGDB/CMake/embedded/dummy.c.obj",
			"sourceGroupIndex" : 2
		}
	],
	"type" : "OBJECT_LIBRARY"
}
