:10000000380000EA050000EA060000EA070000EAFE
:10001000080000EA0000A0E1160000EA130000EA70
:100020000EF0B0E1FDFFFFEA0EF0B0E1FDFFFFEAE8
:1000300004F05EE2FDFFFFEA08004EE2220100EB61
:10004000000090E5200100EB00679FE5920FA0E320
:10005000040086E50800A0E3000086E5080020E231
:10006000EC169FE5011051E2FDFFFF1AF9FFFFEAD0
:1000700004F05EE2FDFFFFEA04E04EE200402DE9FD
:1000800000E04FE1FF402DE9C8169FE544709FE571
:100090001050A0E3003091E5004091E5043483E185
:1000A000004091E5043883E1004091E5043C83E1A0
:1000B000003087E5047087E2045055E2F4FFFF1A30
:1000C00010708FE5FF40BDE80EF069E10080FDE8AB
:1000D000480900004C09000000000000000000007A
:1000E000000000000000000060669FE568169FE5C4
:1000F000001086E5921FA0E3041086E55C169FE5DC
:100100000100A0E3000081E50000A0E3080081E514
:100110000000A0E3C00081E50000A0E3C40081E589
:1001200000000FE18000C0E300F021E10700A0E340
:10013000E80081E568201FE500000FE11F00C0E333
:10014000121080E301F021E1802082E202D0A0E1E0
:1001500000000FE11F00C0E3131080E301F021E174
:10016000FCD59FE59C001FE59C101FE50020A0E347
:10017000042080E4010050E1FCFFFF1AE4059FE544
:100180000F10A0E3001080E5510000EB0103A0E395
:100190000C1090E5010011E3FCFFFF1AC8159FE564
:1001A000041080E5C4159FE5081080E5C0159FE5A3
:1001B000101080E5F61EA0E3001080E50710A0E314
:1001C000581080E50C1090E5031AC1E3A4259FE5C3
:1001D000021081E10C1080E50C1090E5010011E3A4
:1001E000FCFFFF1A0C1090E5021C81E30C1080E567
:1001F0000C1090E5020C11E3FCFFFF1A0123A0E3B1
:10020000000092E5B00000EB040092E5AE0000EBC8
:10021000080092E5AC0000EB0C0092E5AA0000EBB0
:10022000100092E5A80000EBAC0092E5A60000EB00
:10023000AE0100EB40259FE50000A0E3080082E549
:100240000400A0E3140082E5024AA0E3500096E512
:10025000040010E30A00000A20059FE520159FE531
:100260000420A0E3450000EB94011FE5AB10A0E3E0
:10027000010000E0010050E10A00001A0548A0E377
:10028000080000EAFC049FE5FC149FE50420A0E3BD
:100290003A0000EBC0011FE5010050E30100001A25
:1002A0008D0000EB0548A0E3170000EBDC049FE5A0
:1002B0000210A0E3001080E5D4049FE50110A0E344
:1002C000001080E50514A0E30100A0E3080081E52B
:1002D00000F0A0E3BC049FE58310A0E30C1080E5D0
:1002E0000410A0E3001080E50010A0E3041080E5F6
:1002F0000310A0E30C1080E50710A0E3081080E5D0
:100300000310A0E3101080E50EF0A0E100402DE9FD
:100310000400A0E16C0100EB7C049FE5101084E276
:100320000420A0E3150000EB50021FE56C149FE5CC
:10033000010050E10000001A670100EB0104A0E396
:10034000201084E26C221FE50C0000EB50049FE5B6
:10035000141084E20420A0E3080000EB84021FE5EF
:1003600084121FE50000A0E3000050E30100000A32
:10037000D70000EBE5FFFFEA0040BDE80EF0A0E18A
:10038000F8472DE90070A0E10140A0E1028087E07C
:100390000230A0E1E0A39FE50000A0E308008AE5A9
:1003A00000049FE500008AE5200052E3170000CA20
:1003B000025087E0010042E204008AE50000A0E369
:1003C0002C008AE50000A0E31C008AE5300000EB69
:1003D00024009AE5020050E1FCFFFF1A60409AE514
:1003E0000430A0E160409AE5043483E160409AE57E
:1003F000043883E160409AE5043C83E1003087E5FE
:10040000047087E2050057E1F3FFFFBA1D0000EA20
:100410000F00A0E31C008AE51000A0E32C008AE591
:1004200050730FE50000A0E308008AE50200A0E198
:10043000010850E3000000DA0108A0E3005087E063
:10044000010040E20F0080E304008AE5100000EBA9
:1004500080731FE5050057E1FCFFFFBA0000A0E331
:1004600010008AE50000A0E308008AE50200A0E190
:10047000012842E2014884E2010850E3E8FFFFCA94
:100480000000A0E32C008AE50300A0E1F847BDE8E6
:100490000EF0A0E10100A0E308008AE50B00A0E354
:1004A00060008AE52408A0E16000CAE52404A0E118
:1004B0006000CAE56040CAE5AA00A0E36000CAE5A2
:1004C0000100A0E310008AE50EF0A0E10F402DE945
:1004D000F60000EB0F40BDE80EF0A0E100402DE972
:1004E0000104A0E3011AA0E34020A0E3A3FFFFEB77
:1004F000B4129FE50000A0E3000081E578A29FE52B
:100500000000A0E32C008AE5480000EB0000A0E317
:1005100008008AE594029FE500008AE50100A0E357
:1005200008008AE52000A0E360008AE5011AA0E344
:100530002108A0E16000CAE52104A0E16000CAE54D
:100540006010CAE50100A0E310008AE528009AE5E2
:10055000040010E3FCFFFF0A28009AE5010010E305
:10056000FCFFFF1A470000EB020010E3FCFFFF1A3C
:100570002E0000EB0000A0E308008AE52C029FE5B6
:1005800000008AE50124A0E3383082E20100A0E304
:1005900008008AE50200A0E360008AE5011AA0E3F2
:1005A0002108A0E16000CAE52104A0E16000CAE5DD
:1005B0006010CAE51C4082E2000092E560008AE516
:1005C000012082E2040052E1FAFFFF1A0100A0E3D9
:1005D00010008AE520109AE5200051E3FCFFFF0A95
:1005E000004092E560408AE5012082E2030052E18A
:1005F0000100000A011081E2F6FFFFEA28009AE5F7
:10060000040010E3FCFFFF0A28009AE5010010E354
:10061000FCFFFF1A1B0000EB020010E3FCFFFF1AB7
:100620000000A0E308008AE50040BDE80EF0A0E16C
:1006300000402DE90000A0E308008AE56C019FE579
:1006400000008AE50100A0E308008AE50600A0E3B7
:1006500060008AE50100A0E310008AE528009AE521
:10066000040010E3FCFFFF0A28009AE5010010E3F4
:10067000FCFFFF1A030000EB020010E3FCFFFF0A7F
:100680000040BDE80EF0A0E100402DE90000A0E32D
:1006900008008AE50C019FE500008AE50000A0E360
:1006A00004008AE50100A0E308008AE50500A0E354
:1006B00060008AE50100A0E310008AE528009AE5C1
:1006C000080010E3FCFFFF0A60009AE50040BDE867
:1006D0000EF0A0E100402DE90103A0E30C1090E52D
:1006E000010011E3FCFFFF1A7C109FE5041080E578
:1006F00078109FE5081080E574109FE5101080E5E4
:10070000F61EA0E3001080E50710A0E3581080E576
:100710000C1090E5031AC1E358209FE5021081E117
:100720000C1080E50C1090E5010011E3FCFFFF1AAE
:100730000C1090E5021C81E30C1080E50C1090E594
:10074000020C11E3FCFFFF1A0040BDE80EF0A0E12F
:1007500000000105FFFF080060000405FFFF000026
:1007600000000505F40F0000000009050ED80D0279
:1007700008000700770100000110000000000405D8
:10078000DC0000001C100000DC000000281000004D
:10079000002001040420010400000305E000000023
:1007A000FFFFFFFFE4000000C77300002800000106
:1007B000C77100000DC0A0E100D82DE90C309FE505
:1007C000002093E504B04CE2000083E500A81BE99B
:1007D000000001050DC0A0E100D82DE904B04CE2F5
:1007E0000000A0E3F2FFFFEBFCFFFFEA00A81BE91B
:1007F0000DC0A0E100D82DE904B04CE200C0A0E398
:1008000001005CE1070000AA20309FE5003093E57D
:10081000020013E318209F150C30D01701C08C1272
:1008200000308215F5FFFFEA0100A0E100A81BE9F6
:100830007C000305000003050DC0A0E100D82DE9F0
:1008400004B04CE20110A0E304D04DE20D004BE5F2
:100850000D004BE2E5FFFFEB00A81BE90DC0A0E196
:1008600000D82DE904B04CE20030D0E50020A0E132
:10087000000053E30200000A0130F2E5000053E3F8
:10088000FCFFFF1A020060E000A81BE90DC0A0E118
:1008900010D82DE904B04CE20040A0E1EEFFFFEBE0
:1008A0000010A0E10400A0E1D0FFFFEB10A81BE9BD
:1008B0000DC0A0E100D82DE904B04CE20730A0E360
:1008C000013053E2FDFFFF5A00A81BE90DC0A0E173
:1008D00000D82DE904B04CE200A81BE90DC0A0E14E
:1008E00000D82DE904B04CE2B9FFFFEB00A81BE9EA
:1008F0000DC0A0E100D82DE904B04CE200A81BE92E
:100900000DC0A0E100D82DE904B04CE20020A0E326
:1009100002C0A0E10300C0E3000052E10500002A8C
:100920000134A0E303309CE704C08CE200005CE1EA
:10093000032082E0F9FFFF3A020051E10000E013DA
:080940000000A00300A81BE960
:00000001FF
