S00F000061726D626F6F742E7372656321
S1130000380000EA050000EA060000EA070000EAFA
S1130010080000EA0000A0E1160000EA130000EA6C
S11300200EF0B0E1FDFFFFEA0EF0B0E1FDFFFFEAE4
S113003004F05EE2FDFFFFEA08004EE2220100EB5D
S1130040000090E5200100EB00679FE5920FA0E31C
S1130050040086E50800A0E3000086E5080020E22D
S1130060EC169FE5011051E2FDFFFF1AF9FFFFEACC
S113007004F05EE2FDFFFFEA04E04EE200402DE9F9
S113008000E04FE1FF402DE9C8169FE544709FE56D
S11300901050A0E3003091E5004091E5043483E181
S11300A0004091E5043883E1004091E5043C83E19C
S11300B0003087E5047087E2045055E2F4FFFF1A2C
S11300C010708FE5FF40BDE80EF069E10080FDE8A7
S11300D0480900004C090000000000000000000076
S11300E0000000000000000060669FE568169FE5C0
S11300F0001086E5921FA0E3041086E55C169FE5D8
S11301000100A0E3000081E50000A0E3080081E510
S11301100000A0E3C00081E50000A0E3C40081E585
S113012000000FE18000C0E300F021E10700A0E33C
S1130130E80081E568201FE500000FE11F00C0E32F
S1130140121080E301F021E1802082E202D0A0E1DC
S113015000000FE11F00C0E3131080E301F021E170
S1130160FCD59FE59C001FE59C101FE50020A0E343
S1130170042080E4010050E1FCFFFF1AE4059FE540
S11301800F10A0E3001080E5510000EB0103A0E391
S11301900C1090E5010011E3FCFFFF1AC8159FE560
S11301A0041080E5C4159FE5081080E5C0159FE59F
S11301B0101080E5F61EA0E3001080E50710A0E310
S11301C0581080E50C1090E5031AC1E3A4259FE5BF
S11301D0021081E10C1080E50C1090E5010011E3A0
S11301E0FCFFFF1A0C1090E5021C81E30C1080E563
S11301F00C1090E5020C11E3FCFFFF1A0123A0E3AD
S1130200000092E5B00000EB040092E5AE0000EBC4
S1130210080092E5AC0000EB0C0092E5AA0000EBAC
S1130220100092E5A80000EBAC0092E5A60000EBFC
S1130230AE0100EB40259FE50000A0E3080082E545
S11302400400A0E3140082E5024AA0E3500096E50E
S1130250040010E30A00000A20059FE520159FE52D
S11302600420A0E3450000EB94011FE5AB10A0E3DC
S1130270010000E0010050E10A00001A0548A0E373
S1130280080000EAFC049FE5FC149FE50420A0E3B9
S11302903A0000EBC0011FE5010050E30100001A21
S11302A08D0000EB0548A0E3170000EBDC049FE59C
S11302B00210A0E3001080E5D4049FE50110A0E340
S11302C0001080E50514A0E30100A0E3080081E527
S11302D000F0A0E3BC049FE58310A0E30C1080E5CC
S11302E00410A0E3001080E50010A0E3041080E5F2
S11302F00310A0E30C1080E50710A0E3081080E5CC
S11303000310A0E3101080E50EF0A0E100402DE9F9
S11303100400A0E16C0100EB7C049FE5101084E272
S11303200420A0E3150000EB50021FE56C149FE5C8
S1130330010050E10000001A670100EB0104A0E392
S1130340201084E26C221FE50C0000EB50049FE5B2
S1130350141084E20420A0E3080000EB84021FE5EB
S113036084121FE50000A0E3000050E30100000A2E
S1130370D70000EBE5FFFFEA0040BDE80EF0A0E186
S1130380F8472DE90070A0E10140A0E1028087E078
S11303900230A0E1E0A39FE50000A0E308008AE5A5
S11303A000049FE500008AE5200052E3170000CA1C
S11303B0025087E0010042E204008AE50000A0E365
S11303C02C008AE50000A0E31C008AE5300000EB65
S11303D024009AE5020050E1FCFFFF1A60409AE510
S11303E00430A0E160409AE5043483E160409AE57A
S11303F0043883E160409AE5043C83E1003087E5FA
S1130400047087E2050057E1F3FFFFBA1D0000EA1C
S11304100F00A0E31C008AE51000A0E32C008AE58D
S113042050730FE50000A0E308008AE50200A0E194
S1130430010850E3000000DA0108A0E3005087E05F
S1130440010040E20F0080E304008AE5100000EBA5
S113045080731FE5050057E1FCFFFFBA0000A0E32D
S113046010008AE50000A0E308008AE50200A0E18C
S1130470012842E2014884E2010850E3E8FFFFCA90
S11304800000A0E32C008AE50300A0E1F847BDE8E2
S11304900EF0A0E10100A0E308008AE50B00A0E350
S11304A060008AE52408A0E16000CAE52404A0E114
S11304B06000CAE56040CAE5AA00A0E36000CAE59E
S11304C00100A0E310008AE50EF0A0E10F402DE941
S11304D0F60000EB0F40BDE80EF0A0E100402DE96E
S11304E00104A0E3011AA0E34020A0E3A3FFFFEB73
S11304F0B4129FE50000A0E3000081E578A29FE527
S11305000000A0E32C008AE5480000EB0000A0E313
S113051008008AE594029FE500008AE50100A0E353
S113052008008AE52000A0E360008AE5011AA0E340
S11305302108A0E16000CAE52104A0E16000CAE549
S11305406010CAE50100A0E310008AE528009AE5DE
S1130550040010E3FCFFFF0A28009AE5010010E301
S1130560FCFFFF1A470000EB020010E3FCFFFF1A38
S11305702E0000EB0000A0E308008AE52C029FE5B2
S113058000008AE50124A0E3383082E20100A0E300
S113059008008AE50200A0E360008AE5011AA0E3EE
S11305A02108A0E16000CAE52104A0E16000CAE5D9
S11305B06010CAE51C4082E2000092E560008AE512
S11305C0012082E2040052E1FAFFFF1A0100A0E3D5
S11305D010008AE520109AE5200051E3FCFFFF0A91
S11305E0004092E560408AE5012082E2030052E186
S11305F00100000A011081E2F6FFFFEA28009AE5F3
S1130600040010E3FCFFFF0A28009AE5010010E350
S1130610FCFFFF1A1B0000EB020010E3FCFFFF1AB3
S11306200000A0E308008AE50040BDE80EF0A0E168
S113063000402DE90000A0E308008AE56C019FE575
S113064000008AE50100A0E308008AE50600A0E3B3
S113065060008AE50100A0E310008AE528009AE51D
S1130660040010E3FCFFFF0A28009AE5010010E3F0
S1130670FCFFFF1A030000EB020010E3FCFFFF0A7B
S11306800040BDE80EF0A0E100402DE90000A0E329
S113069008008AE50C019FE500008AE50000A0E35C
S11306A004008AE50100A0E308008AE50500A0E350
S11306B060008AE50100A0E310008AE528009AE5BD
S11306C0080010E3FCFFFF0A60009AE50040BDE863
S11306D00EF0A0E100402DE90103A0E30C1090E529
S11306E0010011E3FCFFFF1A7C109FE5041080E574
S11306F078109FE5081080E574109FE5101080E5E0
S1130700F61EA0E3001080E50710A0E3581080E572
S11307100C1090E5031AC1E358209FE5021081E113
S11307200C1080E50C1090E5010011E3FCFFFF1AAA
S11307300C1090E5021C81E30C1080E50C1090E590
S1130740020C11E3FCFFFF1A0040BDE80EF0A0E12B
S113075000000105FFFF080060000405FFFF000022
S113076000000505F40F0000000009050ED80D0275
S113077008000700770100000110000000000405D4
S1130780DC0000001C100000DC0000002810000049
S1130790002001040420010400000305E00000001F
S11307A0FFFFFFFFE4000000C77300002800000102
S11307B0C77100000DC0A0E100D82DE90C309FE501
S11307C0002093E504B04CE2000083E500A81BE997
S11307D0000001050DC0A0E100D82DE904B04CE2F1
S11307E00000A0E3F2FFFFEBFCFFFFEA00A81BE917
S11307F00DC0A0E100D82DE904B04CE200C0A0E394
S113080001005CE1070000AA20309FE5003093E579
S1130810020013E318209F150C30D01701C08C126E
S113082000308215F5FFFFEA0100A0E100A81BE9F2
S11308307C000305000003050DC0A0E100D82DE9EC
S113084004B04CE20110A0E304D04DE20D004BE5EE
S11308500D004BE2E5FFFFEB00A81BE90DC0A0E192
S113086000D82DE904B04CE20030D0E50020A0E12E
S1130870000053E30200000A0130F2E5000053E3F4
S1130880FCFFFF1A020060E000A81BE90DC0A0E114
S113089010D82DE904B04CE20040A0E1EEFFFFEBDC
S11308A00010A0E10400A0E1D0FFFFEB10A81BE9B9
S11308B00DC0A0E100D82DE904B04CE20730A0E35C
S11308C0013053E2FDFFFF5A00A81BE90DC0A0E16F
S11308D000D82DE904B04CE200A81BE90DC0A0E14A
S11308E000D82DE904B04CE2B9FFFFEB00A81BE9E6
S11308F00DC0A0E100D82DE904B04CE200A81BE92A
S11309000DC0A0E100D82DE904B04CE20020A0E322
S113091002C0A0E10300C0E3000052E10500002A88
S11309200134A0E303309CE704C08CE200005CE1E6
S1130930032082E0F9FFFF3A020051E10000E013D6
S10B09400000A00300A81BE95C
S9030000FC
