play 0.5 1 1 1;
play 0.5 1 1 1;
play 0.5 1 1 1;
play 0.5 1 1 1;

play 0.5 2 2 2;
play 0.5 2 2 2;
play 0.5 2 2 2;
play 0.5 2 2 2;

play 0.5 1 1 1;
play 0.5 1 1 1;
play 0.5 1 1 1;
play 0.5 1 1 1;

play 0.5 2 2 2;
play 0.5 2 2 2;
play 0.5 2 2 2;
play 0.5 2 2 2;

play 0.5 1 1 1;
play 0.5 1 1 1;
play 0.5 1 1 1;
play 0.5 1 1 1;

play 0.5 2 2 2;
play 0.5 2 2 2;
play 0.5 2 2 2;
play 0.5 2 2 2