{
  headers:{
    Authorization:Bearer 8VmVWyYlg314MAEHHEmXol4daT4SNyrgDbOFf,
    Accept:application/json},
  body:{
    index:6,
    type:PICKLIST,
    options:[Duru Elkhater,Duru Elkhater,rwrwr,orıpoşjfg,eeheur6u5uu,didem8]
  }
}"
