{
	"info": {
		"_postman_id": "5a90a07d-b7ad-4272-a2d2-771373c5505b",
		"name": "GasStations",
		"schema": "https://schema.getpostman.com/json/collection/v2.1.0/collection.json",
		"_exporter_id": "21835784"
	},
	"item": [
		{
			"name": "Import Gas Stations",
			"request": {
				"method": "POST",
				"header": [],
				"url": {
					"raw": "http://localhost:8080/api/gas-stations/import-data",
					"protocol": "http",
					"host": [
						"localhost"
					],
					"port": "8080",
					"path": [
						"api",
						"gas-stations",
						"import-data"
					]
				}
			},
			"response": []
		},
		{
			"name": "Gas Stations By Name",
			"request": {
				"method": "GET",
				"header": [],
				"url": {
					"raw": "http://localhost:8080/api/gas-stations?name=Shell Berlin Oranienstr",
					"protocol": "http",
					"host": [
						"localhost"
					],
					"port": "8080",
					"path": [
						"api",
						"gas-stations"
					],
					"query": [
						{
							"key": "name",
							"value": "Shell Berlin Oranienstr"
						}
					]
				}
			},
			"response": []
		},
		{
			"name": "Fuel Type Median Price",
			"request": {
				"method": "GET",
				"header": [],
				"url": {
					"raw": "http://localhost:8080/api/gas-stations/median-price?fuelType=diesel",
					"protocol": "http",
					"host": [
						"localhost"
					],
					"port": "8080",
					"path": [
						"api",
						"gas-stations",
						"median-price"
					],
					"query": [
						{
							"key": "fuelType",
							"value": "diesel"
						}
					]
				}
			},
			"response": []
		},
		{
			"name": "Fuel Type Min Price",
			"request": {
				"method": "GET",
				"header": [],
				"url": {
					"raw": "http://localhost:8080/api/gas-stations/min-price?fuelType=diesel",
					"protocol": "http",
					"host": [
						"localhost"
					],
					"port": "8080",
					"path": [
						"api",
						"gas-stations",
						"min-price"
					],
					"query": [
						{
							"key": "fuelType",
							"value": "diesel"
						}
					]
				}
			},
			"response": []
		},
		{
			"name": "Fuel Type Max Price",
			"request": {
				"method": "GET",
				"header": [],
				"url": {
					"raw": "http://localhost:8080/api/gas-stations/max-price?fuelType=diesel",
					"protocol": "http",
					"host": [
						"localhost"
					],
					"port": "8080",
					"path": [
						"api",
						"gas-stations",
						"max-price"
					],
					"query": [
						{
							"key": "fuelType",
							"value": "diesel"
						}
					]
				}
			},
			"response": []
		}
	]
}