{
  "packageId": "com.airhorner.twa",
  "host": "airhorner.com",
  "name": "The Air Horner",
  "launcherName": "Airhorner",
  "display": "standalone",
  "themeColor": "#2196F3",
  "navigationColor": "#000000",
  "navigationColorDark": "#000000",
  "navigationDividerColor": "#000000",
  "navigationDividerColorDark": "#000000",
  "backgroundColor": "#2196F3",
  "enableNotifications": true,
  "startUrl": "/?homescreen=1",
  "iconUrl": "https://airhorner.com/images/touch/android-launchericon-512-512.png",
  "maskableIconUrl": "https://airhorner.com/images/touch/android-maskableicon-512-512.png",
  "splashScreenFadeOutDuration": 300,
  "signingKey": {
    "path": "/Users/biche/Projects/pwa/omdb2/android.keystore",
    "alias": "android"
  },
  "appVersionName": "1",
  "appVersionCode": 1,
  "shortcuts": [],
  "generatorApp": "bubblewrap-cli",
  "webManifestUrl": "https://airhorner.com/manifest.json",
  "fallbackType": "customtabs",
  "features": {},
  "alphaDependencies": {
    "enabled": false
  },
  "enableSiteSettingsShortcut": true,
  "isChromeOSOnly": false,
  "isMetaQuest": false,
  "fullScopeUrl": "https://airhorner.com/",
  "minSdkVersion": 19,
  "orientation": "default",
  "fingerprints": [],
  "additionalTrustedOrigins": [],
  "retainedBundles": [],
  "appVersion": "1"
}