{
  "extends": ["tslint:latest", "tslint-config-prettier", "tslint-immutable"],
  "rules": {
    // TypeScript specific
    // Source: https://palantir.github.io/tslint/rules/#typescript-specific
    "adjacent-overload-signatures": false,
    "ban-ts-ignore": false,
    "ban-types": false,
    "member-access": true,
    "member-ordering": [
      true,
      {
        "order": [
          "public-static-field",
          "public-instance-field",
          "public-constructor",
          "private-static-field",
          "private-instance-field",
          "private-constructor",
          "public-instance-method",
          "protected-instance-method",
          "private-instance-method"
        ],
        "alphabetize": true
      }
    ],
    "no-any": false,
    "no-empty-interface": true,
    "no-for-in": true,
    "no-import-side-effect": false,
    "no-internal-module": false,
    "no-inferrable-types": false,
    "no-magic-numbers": true,
    "no-namespace": false,
    "no-non-null-assertion": true,
    "no-parameter-reassignment": true,
    "no-reference": true,
    "no-unnecessary-type-assertion": true,
    "no-var-requires": true,
    "only-arrow-functions": false,
    "prefer-for-of": true,
    "promise-function-async": true,
    "typedef": [true, "call-signature"],

    // Functionality
    // Source: https://palantir.github.io/tslint/rules/#functionality
    "await-promise": true,
    "ban-comma-operator": true,
    "curly": true,
    "function-constructor": true,
    "no-arg": true,
    "no-async-without-await": true,
    "no-bitwise": true,
    "no-conditional-assignment": true,
    "no-console": [true, "log", "error"],
    "no-construct": true,
    "no-debugger": true,
    "no-duplicate-super": true,
    "no-duplicate-switch-case": true,
    "no-duplicate-variable": true,
    "no-empty": true,
    "no-eval": true,
    "no-for-in-array": true,
    "no-implicit-dependencies": [true, "dev"],
    "no-inferred-empty-object-type": true,
    "no-invalid-template-strings": true,
    "no-invalid-this": [true, "check-function-in-method"],
    "no-misused-new": true,
    "no-promise-as-boolean": true,
    "no-return-await": true,
    "no-shadowed-variable": true,
    "no-sparse-arrays": true,
    "no-string-literal": false,
    "no-string-throw": true,
    // TODO: allow devDependencies only in **/*.spec.ts files:
    // waiting on https://github.com/palantir/tslint/pull/3708
    "no-switch-case-fall-through": true,
    "no-tautology-expression": true,
    "no-this-assignment": true,
    "no-unnecessary-class": ["allow-constructor-only", "allow-static-only"],
    "no-unsafe-any": false,
    "no-unsafe-finally": true,
    "no-unused-expression": true,
    "no-var-keyword": true,
    "prefer-conditional-expression": true,
    "prefer-object-spread": true,
    "radix": true,
    "restrict-plus-operands": true,
    "static-this": true,
    "strict-boolean-expressions": false,
    "strict-comparisons": true,
    "strict-string-expressions": true,
    "strict-type-predicates": true,
    "switch-default": true,
    "triple-equals": true,
    "unnecessary-constructor": true,
    "use-default-type-parameter": true,
    "use-isnan": true,

    // Maintainability
    // Source: https://palantir.github.io/tslint/rules/#maintainability
    "cyclomatic-complexity": true,
    "deprecation": true,
    "invalid-void": true,
    "max-classes-per-file": [true, 5, "exclude-class-expressions"],
    "max-file-line-count": [true, 500],
    "no-default-export": true,
    "no-duplicate-imports": [true, {"allow-namespace-imports": true}],
    "no-mergeable-namespace": true,
    "no-require-imports": false,
    "object-literal-sort-keys": [
      true,
      "ignore-case",
      "locale-compare",
      "match-declaration-order",
      "shorthand-first"
    ],
    "prefer-const": true,
    "prefer-readonly": true,

    // Style
    // Source: https://palantir.github.io/tslint/rules/#style
    "array-type": [true, "array"],
    "arrow-return-shorthand": true,
    "binary-expression-operand-order": true,
    "class-name": true,
    "comment-format": [true, "check-space", "check-uppercase", "allow-trailing-lowercase"],
    "comment-type": [true, "doc", "singleline"],
    "completed-docs": [true, "enums", "functions", "methods", "classes", "namespaces"],
    "encoding": true,
    // TODO
    "file-header": false,
    "file-name-casing": [true, "kebab-case"],
    "increment-decrement": true,
    "interface-name": [true, "never-prefix"],
    "interface-over-type-literal": true,
    "match-default-export-name": false,
    "no-angle-bracket-type-assertion": true,
    "no-boolean-literal-compare": true,
    "no-parameter-properties": true,
    "no-redundant-jsdoc": true,
    "no-unnecessary-callback-wrapper": true,
    "no-unnecessary-initializer": true,
    "no-unnecessary-qualifier": true,
    "object-literal-key-quotes": [true, "as-needed"],
    "object-literal-shorthand": true,
    "one-line": [true, "check-catch", "check-finally", "check-else", "check-open-brace", "check-whitespace"],
    "one-variable-per-declaration": true,
    "ordered-imports": true,
    "prefer-function-over-method": true,
    "prefer-method-signature": true,
    "prefer-switch": [true, {"min-cases": 4}],
    "prefer-template": [true, "allow-single-concat"],
    "prefer-while": false,
    "return-undefined": true,
    "space-before-function-paren": false,
    "type-literal-delimiter": true,
    "unnecessary-bind": true,
    "unnecessary-else": true,
    "variable-name": {
      "options": [
        "ban-keywords",
        "check-format",
        "allow-leading-underscore",
        "allow-pascal-case"
      ]
    },

    // Format
    // Source: https://palantir.github.io/tslint/rules/#format
    "align": true,
    "arrow-parens": false,
    "eofline": true,
    "import-spacing": true,
    "jsdoc-format": true,
    "linebreak-style": [true, "LF"],
    "max-line-length": [true, 120],
    "newline-before-return": true,
    "new-parens": true,
    "no-consecutive-blank-lines": [true, 2],
    "no-irregular-whitespace": true,
    "no-trailing-whitespace": true,
    "number-literal-format": true,
    "quotemark": [true, "single", "avoid-escape", "avoid-template"],
    "semicolon": [true, "always"],

    // tslint-immutable rules
    // Immutability rules
    "readonly-keyword": true,
    "readonly-array": true,
    "no-let": true,
    "no-object-mutation": true,
    "no-delete": true,
    "no-method-signature": true,
    // Functional style rules
    "no-this": false,
    "no-class": false,
    "no-mixed-interface": true,
    "no-expression-statement": false,
    "no-if-statement": false
  }
}
