{
  "10.04": "lucid",
  "10.10": "maverick",
  "11.04": "natty",
  "11.10": "oneiric",
  "12.04": "precise",
  "12.10": "quantal",
  "13.04": "raring",
  "13.10": "saucy",
  "14.04": "trusty",
  "14.10": "utopic",
  "15.04": "vivid",
  "15.10": "wily",
  "16.04": "xenial",
  "16.10": "yakkety",
  "17.04": "zesty",
  "17.10": "artful",
  "18.04": "bionic",
  "18.10": "cuttlefish",
  "19.04": "disco",
  "19.10": "eoan",
  "20.04": "focal",
  "20.10": "groovy",
  "21.04": "hirsute"
}
