<svg width="130" height="50" xmlns="http://www.w3.org/2000/svg">
    <foreignObject width="130" height="50">
        <div xmlns="http://www.w3.org/1999/xhtml">
            <style>
                .button {
                    color: white;
                    background-color: #0db7ed !important;
                    border-color: #0084BA !important;
                    font-weight: 300;
                    font-size: 16px;
                    font-family: "Helvetica Neue Light", "Helvetica Neue", Helvetica, Arial, "Lucida Grande", sans-serif;
                    text-decoration: none;
                    text-align: center;
                    line-height: 40px;
                    height: 40px;
                    padding: 0 40px;
                    margin: 0;
                    display: inline-block;
                    appearance: none;
                    cursor: pointer;
                    border: none;
                    -webkit-box-sizing: border-box;
                    -moz-box-sizing: border-box;
                    box-sizing: border-box;
                    -webkit-transition-property: all;
                    transition-property: all;
                    -webkit-transition-duration: .3s;
                    transition-duration: .3s;
                    padding-left: 14px;
                    padding-right: 14px;
                    font-weight: 400;
                }

                .button>span {
                    padding-left: 6px;
                }

                .button:visited {
                    color: white;
                }

                .button:hover,
                .button:focus {
                    opacity: 0.75;
                    text-decoration: none;
                    outline: none;
                }

                .button:active,
                .button.active,
                .button.is-active {
                    opacity: 0.8;
                    text-shadow: 0 1px 0 rgba(255, 255, 255, 0.3);
                    text-decoration: none;
                    /*background-color: rgba(0, 0, 0, 0.11);*/
                    color: #d4d4d4;
                    -webkit-transition-duration: 0s;
                    transition-duration: 0s;
                    -webkit-box-shadow: inset 0 1px 3px rgba(0, 0, 0, 0.2);
                    box-shadow: inset 0 1px 3px rgba(0, 0, 0, 0.2);
                }

                .button:active > svg {
                    fill: #d4d4d4;
                    -webkit-transition-duration: 0s;
                    transition-duration: 0s;
                }

                .button-large {
                    font-size: 20px;
                    height: 50px;
                    line-height: 50px;
                }

                .button-border {
                    background: none;
                    border-width: 2px;
                    border-style: solid;
                    line-height: 36px;
                }

                .button>svg {
                    width: 35px;
                    height: 35px;
                    float: left;
                    fill: white;
                    -webkit-transition-property: all;
                    transition-property: all;
                    -webkit-transition-duration: .3s;
                    transition-duration: .3s;
                }
            </style>
            <button class="button button-large button-border"><svg xmlns="http://www.w3.org/2000/svg"
                    viewBox="0 0 640 512">
                    <path
                        d="M349.9 236.3h-66.1v-59.4h66.1v59.4zm0-204.3h-66.1v60.7h66.1V32zm78.2 144.8H362v59.4h66.1v-59.4zm-156.3-72.1h-66.1v60.1h66.1v-60.1zm78.1 0h-66.1v60.1h66.1v-60.1zm276.8 100c-14.4-9.7-47.6-13.2-73.1-8.4-3.3-24-16.7-44.9-41.1-63.7l-14-9.3-9.3 14c-18.4 27.8-23.4 73.6-3.7 103.8-8.7 4.7-25.8 11.1-48.4 10.7H2.4c-8.7 50.8 5.8 116.8 44 162.1 37.1 43.9 92.7 66.2 165.4 66.2 157.4 0 273.9-72.5 328.4-204.2 21.4.4 67.6.1 91.3-45.2 1.5-2.5 6.6-13.2 8.5-17.1l-13.3-8.9zm-511.1-27.9h-66v59.4h66.1v-59.4zm78.1 0h-66.1v59.4h66.1v-59.4zm78.1 0h-66.1v59.4h66.1v-59.4zm-78.1-72.1h-66.1v60.1h66.1v-60.1z" />
                </svg><span>Profile</span></button>
        </div>
    </foreignObject>
</svg>