<svg width="50" height="50" xmlns="http://www.w3.org/2000/svg">
    <foreignObject width="50" height="50">
        <div xmlns="http://www.w3.org/1999/xhtml">
            <style>
                .button {
                    color: white;
                    background-color: #3d2d00 !important;
                    border-color: #0A0000 !important;
                    font-weight: 300;
                    font-size: 16px;
                    font-family: "Helvetica Neue Light", "Helvetica Neue", Helvetica, Arial, "Lucida Grande", sans-serif;
                    text-decoration: none;
                    text-align: center;
                    line-height: 40px;
                    height: 40px;
                    padding: 0 40px;
                    margin: 0;
                    display: inline-block;
                    appearance: none;
                    cursor: pointer;
                    border: none;
                    -webkit-box-sizing: border-box;
                    -moz-box-sizing: border-box;
                    box-sizing: border-box;
                    -webkit-transition-property: all;
                    transition-property: all;
                    -webkit-transition-duration: .3s;
                    transition-duration: .3s;
                }

                .button:visited {
                    color: white;
                }

                .button:hover,
                .button:focus {
                    opacity: 0.75;
                    text-decoration: none;
                    outline: none;
                }

                .button:active,
                .button.active,
                .button.is-active {
                    opacity: 0.8;
                    text-shadow: 0 1px 0 rgba(255, 255, 255, 0.3);
                    text-decoration: none;
                    /*background-color: rgba(0, 0, 0, 0.11);*/
                    color: #d4d4d4;
                    -webkit-transition-duration: 0s;
                    transition-duration: 0s;
                    -webkit-box-shadow: inset 0 1px 3px rgba(0, 0, 0, 0.2);
                    box-shadow: inset 0 1px 3px rgba(0, 0, 0, 0.2);
                }

                .button:active>svg {
                    fill: #d4d4d4;
                    -webkit-transition-duration: 0s;
                    transition-duration: 0s;
                }

                .button-square {
                    border-radius: 0;
                }

                .button-circle,
                .button-box,
                .button-square {
                    padding: 0 !important;
                    width: 40px;
                }

                .button-square.button-large {
                    width: 50px;
                }

                .button-large {
                    font-size: 20px;
                    height: 50px;
                    line-height: 50px;
                    padding: 0 50px;
                }

                .button-border,
                .button-border-thin,
                .button-border-thick {
                    background: none;
                    border-width: 2px;
                    border-style: solid;
                    line-height: 36px;
                }

                .button>svg {
                    padding-left: 5.5px;
                    width: 35px;
                    height: 35px;
                    float: left;
                    fill: white;
                    -webkit-transition-property: all;
                    transition-property: all;
                    -webkit-transition-duration: .3s;
                    transition-duration: .3s;
                }
            </style>
            <button class="button button-large button-border button-square"><svg xmlns="http://www.w3.org/2000/svg"
                    viewBox="0 0 496 512">
                    <path
                        d="M165.9 397.4c0 2-2.3 3.6-5.2 3.6-3.3.3-5.6-1.3-5.6-3.6 0-2 2.3-3.6 5.2-3.6 3-.3 5.6 1.3 5.6 3.6zm-31.1-4.5c-.7 2 1.3 4.3 4.3 4.9 2.6 1 5.6 0 6.2-2s-1.3-4.3-4.3-5.2c-2.6-.7-5.5.3-6.2 2.3zm44.2-1.7c-2.9.7-4.9 2.6-4.6 4.9.3 2 2.9 3.3 5.9 2.6 2.9-.7 4.9-2.6 4.6-4.6-.3-1.9-3-3.2-5.9-2.9zM244.8 8C106.1 8 0 113.3 0 252c0 110.9 69.8 205.8 169.5 239.2 12.8 2.3 17.3-5.6 17.3-12.1 0-6.2-.3-40.4-.3-61.4 0 0-70 15-84.7-29.8 0 0-11.4-29.1-27.8-36.6 0 0-22.9-15.7 1.6-15.4 0 0 24.9 2 38.6 25.8 21.9 38.6 58.6 27.5 72.9 20.9 2.3-16 8.8-27.1 16-33.7-55.9-6.2-112.3-14.3-112.3-110.5 0-27.5 7.6-41.3 23.6-58.9-2.6-6.5-11.1-33.3 2.6-67.9 20.9-6.5 69 27 69 27 20-5.6 41.5-8.5 62.8-8.5s42.8 2.9 62.8 8.5c0 0 48.1-33.6 69-27 13.7 34.7 5.2 61.4 2.6 67.9 16 17.7 25.8 31.5 25.8 58.9 0 96.5-58.9 104.2-114.8 110.5 9.2 7.9 17 22.9 17 46.4 0 33.7-.3 75.4-.3 83.6 0 6.5 4.6 14.4 17.3 12.1C428.2 457.8 496 362.9 496 252 496 113.3 383.5 8 244.8 8zM97.2 352.9c-1.3 1-1 3.3.7 5.2 1.6 1.6 3.9 2.3 5.2 1 1.3-1 1-3.3-.7-5.2-1.6-1.6-3.9-2.3-5.2-1zm-10.8-8.1c-.7 1.3.3 2.9 2.3 3.9 1.6 1 3.6.7 4.3-.7.7-1.3-.3-2.9-2.3-3.9-2-.6-3.6-.3-4.3.7zm32.4 35.6c-1.6 1.3-1 4.3 1.3 6.2 2.3 2.3 5.2 2.6 6.5 1 1.3-1.3.7-4.3-1.3-6.2-2.2-2.3-5.2-2.6-6.5-1zm-11.4-14.7c-1.6 1-1.6 3.6 0 5.9 1.6 2.3 4.3 3.3 5.6 2.3 1.6-1.3 1.6-3.9 0-6.2-1.4-2.3-4-3.3-5.6-2z" />
                </svg></button>
        </div>
    </foreignObject>
</svg>