{
  "version": "1.0",
  "engine": "darwin|Transformer|1.35.0|latest|latest",
  "containerized": false,
  "host_distro": {
    "name": "",
    "version": "",
    "display_name": "Big Sur (11.3)"
  },
  "type": "build",
  "state": "done",
  "target_reference": "megabytelabs/packer:latest",
  "system": {
    "type": "Linux",
    "release": "5.10.25-linuxkit",
    "distro": {
      "name": "Alpine Linux",
      "version": "3.14.0",
      "display_name": "Alpine Linux v3.14"
    }
  },
  "source_image": {
    "identity": {
      "id": "sha256:aaaa72d23d9e47154cd96e93500e4b8ee9445d99a386dc540702de2bb7efabc2",
      "tags": ["1.7.3", "latest"],
      "names": ["megabytelabs/packer:1.7.3", "megabytelabs/packer:latest"]
    },
    "size": 53521787,
    "size_human": "54 MB",
    "create_time": "2021-06-16T21:23:27Z",
    "docker_version": "",
    "architecture": "amd64",
    "os": "linux",
    "labels": {
      "maintainer": "Megabyte Labs <help@megabyte.space",
      "org.opencontainers.image.authors": "Brian Zalewski <brian@megabyte.space>",
      "org.opencontainers.image.created": "2021-06-16T17:28:50-04:00",
      "org.opencontainers.image.description": "A compact Packer container that you can use in CI environments as well as from the command-line as a one-liner (only 33.1304 MB compressed!)",
      "org.opencontainers.image.documentation": "https://gitlab.com/megabyte-labs/dockerfile/ci-pipeline/packer/-/blob/master/README.md",
      "org.opencontainers.image.licenses": "MIT",
      "org.opencontainers.image.revision": "06c0702478ed78174a73b07bb9155ea81815b23e",
      "org.opencontainers.image.source": "https://gitlab.com/megabyte-labs/dockerfile/ci-pipeline/packer.git",
      "org.opencontainers.image.url": "https://megabyte.space",
      "org.opencontainers.image.vendor": "Megabyte Labs",
      "org.opencontainers.image.version": "1.7.3",
      "space.megabyte.type": "ci-pipeline"
    },
    "env_vars": ["PATH=/usr/local/sbin:/usr/local/bin:/usr/sbin:/usr/bin:/sbin:/bin", "container=docker"]
  },
  "minified_image_size": 46328991,
  "minified_image_size_human": "46 MB",
  "minified_image": "megabytelabs/packer:slim",
  "minified_image_has_data": true,
  "minified_by": 1.1552547518248346,
  "artifact_location": "/tmp/docker-slim-state/.docker-slim-state/images/aaaa72d23d9e47154cd96e93500e4b8ee9445d99a386dc540702de2bb7efabc2/artifacts",
  "container_report_name": "creport.json",
  "seccomp_profile_name": "megabytelabs-packer-seccomp.json",
  "apparmor_profile_name": "megabytelabs-packer-apparmor-profile",
  "image_stack": [
    {
      "is_top_image": true,
      "id": "sha256:aaaa72d23d9e47154cd96e93500e4b8ee9445d99a386dc540702de2bb7efabc2",
      "full_name": "megabytelabs/packer:1.7.3",
      "repo_name": "megabytelabs/packer",
      "version_tag": "1.7.3",
      "raw_tags": ["megabytelabs/packer:1.7.3", "megabytelabs/packer:latest"],
      "create_time": "2021-06-16T21:23:27Z",
      "new_size": 53521787,
      "new_size_human": "54 MB",
      "instructions": [
        {
          "type": "ADD",
          "time": "2021-06-15T22:19:37Z",
          "is_nop": true,
          "local_image_exists": false,
          "layer_index": 0,
          "size": 5595013,
          "size_human": "5.6 MB",
          "params": "file:f278386b0cef68136129f5f58c52445590a417b624d62bca158d4dc926c340df in /",
          "command_snippet": "ADD file:f278386b0cef68136129f5f58c52445590a...",
          "command_all": "ADD file:f278386b0cef68136129f5f58c52445590a417b624d62bca158d4dc926c340df /",
          "target": "/",
          "source_type": "file"
        },
        {
          "type": "CMD",
          "time": "2021-06-15T22:19:37Z",
          "is_nop": true,
          "is_exec_form": true,
          "local_image_exists": false,
          "layer_index": 0,
          "size": 0,
          "params": "[\"/bin/sh\"]",
          "command_snippet": "CMD [\"/bin/sh\"]",
          "command_all": "CMD [\"/bin/sh\"]"
        },
        {
          "type": "RUN",
          "time": "2021-06-16T21:17:05Z",
          "is_nop": false,
          "is_exec_form": true,
          "local_image_exists": false,
          "layer_index": 0,
          "size": 0,
          "command_snippet": "RUN [\"ENV\",\"container=docker\"]",
          "command_all": "RUN [\"ENV\",\"container=docker\"]",
          "system_commands": ["[\"ENV\",\"container=docker\"]"],
          "comment": "buildkit.dockerfile.v0"
        },
        {
          "type": "RUN",
          "time": "2021-06-16T21:17:05Z",
          "is_nop": false,
          "is_exec_form": true,
          "local_image_exists": false,
          "layer_index": 0,
          "size": 32062628,
          "size_human": "32 MB",
          "command_snippet": "RUN [\"COPY\",\"/usr/local/bin/packer\",\"/usr/lo...",
          "command_all": "RUN [\"COPY\",\"/usr/local/bin/packer\",\"/usr/local/bin/packer\"]",
          "system_commands": ["[\"COPY\",\"/usr/local/bin/packer\",\"/usr/local/bin/packer\"]"],
          "comment": "buildkit.dockerfile.v0"
        },
        {
          "type": "RUN",
          "time": "2021-06-16T21:23:27Z",
          "is_nop": false,
          "is_exec_form": true,
          "local_image_exists": false,
          "layer_index": 0,
          "size": 15864146,
          "size_human": "16 MB",
          "command_snippet": "RUN [\"RUN\",\"/bin/sh\",\"-c\",\"apk\",\"--no-cache\"...",
          "command_all": "RUN [\"RUN\",\"/bin/sh\",\"-c\",\"apk\",\"--no-cache\",\"add\",\"bash~=5\",\"curl~=7\",\"git~=2\"]",
          "system_commands": [
            "[\"RUN\",\"/bin/sh\",\"-c\",\"apk\",\"--no-cache\",\"add\",\"bash~=5\",\"curl~=7\",\"git~=2\"]"
          ],
          "comment": "buildkit.dockerfile.v0"
        },
        {
          "type": "RUN",
          "time": "2021-06-16T21:23:27Z",
          "is_nop": false,
          "is_exec_form": true,
          "local_image_exists": false,
          "layer_index": 0,
          "size": 0,
          "command_snippet": "RUN [\"WORKDIR\",\"/work\"]",
          "command_all": "RUN [\"WORKDIR\",\"/work\"]",
          "system_commands": ["[\"WORKDIR\",\"/work\"]"],
          "comment": "buildkit.dockerfile.v0"
        },
        {
          "type": "RUN",
          "time": "2021-06-16T21:23:27Z",
          "is_nop": false,
          "is_exec_form": true,
          "local_image_exists": false,
          "layer_index": 0,
          "size": 0,
          "command_snippet": "RUN [\"ENTRYPOINT\",\"[packer]\"]",
          "command_all": "RUN [\"ENTRYPOINT\",\"[packer]\"]",
          "system_commands": ["[\"ENTRYPOINT\",\"[packer]\"]"],
          "comment": "buildkit.dockerfile.v0"
        },
        {
          "type": "RUN",
          "time": "2021-06-16T21:23:27Z",
          "is_nop": false,
          "is_exec_form": true,
          "local_image_exists": false,
          "layer_index": 0,
          "size": 0,
          "command_snippet": "RUN [\"CMD\",\"[--version]\"]",
          "command_all": "RUN [\"CMD\",\"[--version]\"]",
          "system_commands": ["[\"CMD\",\"[--version]\"]"],
          "comment": "buildkit.dockerfile.v0"
        },
        {
          "type": "RUN",
          "time": "2021-06-16T21:23:27Z",
          "is_nop": false,
          "is_exec_form": true,
          "local_image_exists": false,
          "layer_index": 0,
          "size": 0,
          "command_snippet": "RUN [\"ARG\",\"BUILD_DATE\"]",
          "command_all": "RUN [\"ARG\",\"BUILD_DATE\"]",
          "system_commands": ["[\"ARG\",\"BUILD_DATE\"]"],
          "comment": "buildkit.dockerfile.v0"
        },
        {
          "type": "RUN",
          "time": "2021-06-16T21:23:27Z",
          "is_nop": false,
          "is_exec_form": true,
          "local_image_exists": false,
          "layer_index": 0,
          "size": 0,
          "command_snippet": "RUN [\"ARG\",\"REVISION\"]",
          "command_all": "RUN [\"ARG\",\"REVISION\"]",
          "system_commands": ["[\"ARG\",\"REVISION\"]"],
          "comment": "buildkit.dockerfile.v0"
        },
        {
          "type": "RUN",
          "time": "2021-06-16T21:23:27Z",
          "is_nop": false,
          "is_exec_form": true,
          "local_image_exists": false,
          "layer_index": 0,
          "size": 0,
          "command_snippet": "RUN [\"ARG\",\"VERSION\"]",
          "command_all": "RUN [\"ARG\",\"VERSION\"]",
          "system_commands": ["[\"ARG\",\"VERSION\"]"],
          "comment": "buildkit.dockerfile.v0"
        },
        {
          "type": "RUN",
          "time": "2021-06-16T21:23:27Z",
          "is_nop": false,
          "is_exec_form": true,
          "local_image_exists": false,
          "layer_index": 0,
          "size": 0,
          "command_snippet": "RUN [\"LABEL\",\"maintainer=Megabyte\",\"Labs\",\"\\...",
          "command_all": "RUN [\"LABEL\",\"maintainer=Megabyte\",\"Labs\",\"\\u003chelp@megabyte.space\"]",
          "system_commands": ["[\"LABEL\",\"maintainer=Megabyte\",\"Labs\",\"u003chelp@megabyte.space\"]"],
          "comment": "buildkit.dockerfile.v0"
        },
        {
          "type": "RUN",
          "time": "2021-06-16T21:23:27Z",
          "is_nop": false,
          "is_exec_form": true,
          "local_image_exists": false,
          "layer_index": 0,
          "size": 0,
          "command_snippet": "RUN [\"LABEL\",\"org.opencontainers.image.autho...",
          "command_all": "RUN [\"LABEL\",\"org.opencontainers.image.authors=Brian\",\"Zalewski\",\"\\u003cbrian@megabyte.space\\u003e\"]",
          "system_commands": [
            "[\"LABEL\",\"org.opencontainers.image.authors=Brian\",\"Zalewski\",\"u003cbrian@megabyte.spaceu003e\"]"
          ],
          "comment": "buildkit.dockerfile.v0"
        },
        {
          "type": "RUN",
          "time": "2021-06-16T21:23:27Z",
          "is_nop": false,
          "is_exec_form": true,
          "local_image_exists": false,
          "layer_index": 0,
          "size": 0,
          "command_snippet": "RUN [\"LABEL\",\"org.opencontainers.image.creat...",
          "command_all": "RUN [\"LABEL\",\"org.opencontainers.image.created=2021-06-16T17:28:50-04:00\"]",
          "system_commands": ["[\"LABEL\",\"org.opencontainers.image.created=2021-06-16T17:28:50-04:00\"]"],
          "comment": "buildkit.dockerfile.v0"
        },
        {
          "type": "RUN",
          "time": "2021-06-16T21:23:27Z",
          "is_nop": false,
          "is_exec_form": true,
          "local_image_exists": false,
          "layer_index": 0,
          "size": 0,
          "command_snippet": "RUN [\"LABEL\",\"org.opencontainers.image.descr...",
          "command_all": "RUN [\"LABEL\",\"org.opencontainers.image.description=A\",\"compact\",\"Packer\",\"container\",\"that\",\"you\",\"can\",\"use\",\"in\",\"CI\",\"environments\",\"as\",\"well\",\"as\",\"from\",\"the\",\"command-line\",\"as\",\"a\",\"one-liner\",\"(only\",\"33.1304\",\"MB\",\"compressed!)\"]",
          "system_commands": [
            "[\"LABEL\",\"org.opencontainers.image.description=A\",\"compact\",\"Packer\",\"container\",\"that\",\"you\",\"can\",\"use\",\"in\",\"CI\",\"environments\",\"as\",\"well\",\"as\",\"from\",\"the\",\"command-line\",\"as\",\"a\",\"one-liner\",\"(only\",\"33.1304\",\"MB\",\"compressed!)\"]"
          ],
          "comment": "buildkit.dockerfile.v0"
        },
        {
          "type": "RUN",
          "time": "2021-06-16T21:23:27Z",
          "is_nop": false,
          "is_exec_form": true,
          "local_image_exists": false,
          "layer_index": 0,
          "size": 0,
          "command_snippet": "RUN [\"LABEL\",\"org.opencontainers.image.docum...",
          "command_all": "RUN [\"LABEL\",\"org.opencontainers.image.documentation=https://gitlab.com/megabyte-labs/dockerfile/ci-pipeline/packer/-/blob/master/README.md\"]",
          "system_commands": [
            "[\"LABEL\",\"org.opencontainers.image.documentation=https://gitlab.com/megabyte-labs/dockerfile/ci-pipeline/packer/-/blob/master/README.md\"]"
          ],
          "comment": "buildkit.dockerfile.v0"
        },
        {
          "type": "RUN",
          "time": "2021-06-16T21:23:27Z",
          "is_nop": false,
          "is_exec_form": true,
          "local_image_exists": false,
          "layer_index": 0,
          "size": 0,
          "command_snippet": "RUN [\"LABEL\",\"org.opencontainers.image.licen...",
          "command_all": "RUN [\"LABEL\",\"org.opencontainers.image.licenses=MIT\"]",
          "system_commands": ["[\"LABEL\",\"org.opencontainers.image.licenses=MIT\"]"],
          "comment": "buildkit.dockerfile.v0"
        },
        {
          "type": "RUN",
          "time": "2021-06-16T21:23:27Z",
          "is_nop": false,
          "is_exec_form": true,
          "local_image_exists": false,
          "layer_index": 0,
          "size": 0,
          "command_snippet": "RUN [\"LABEL\",\"org.opencontainers.image.revis...",
          "command_all": "RUN [\"LABEL\",\"org.opencontainers.image.revision=06c0702478ed78174a73b07bb9155ea81815b23e\"]",
          "system_commands": [
            "[\"LABEL\",\"org.opencontainers.image.revision=06c0702478ed78174a73b07bb9155ea81815b23e\"]"
          ],
          "comment": "buildkit.dockerfile.v0"
        },
        {
          "type": "RUN",
          "time": "2021-06-16T21:23:27Z",
          "is_nop": false,
          "is_exec_form": true,
          "local_image_exists": false,
          "layer_index": 0,
          "size": 0,
          "command_snippet": "RUN [\"LABEL\",\"org.opencontainers.image.sourc...",
          "command_all": "RUN [\"LABEL\",\"org.opencontainers.image.source=https://gitlab.com/megabyte-labs/dockerfile/ci-pipeline/packer.git\"]",
          "system_commands": [
            "[\"LABEL\",\"org.opencontainers.image.source=https://gitlab.com/megabyte-labs/dockerfile/ci-pipeline/packer.git\"]"
          ],
          "comment": "buildkit.dockerfile.v0"
        },
        {
          "type": "RUN",
          "time": "2021-06-16T21:23:27Z",
          "is_nop": false,
          "is_exec_form": true,
          "local_image_exists": false,
          "layer_index": 0,
          "size": 0,
          "command_snippet": "RUN [\"LABEL\",\"org.opencontainers.image.url=h...",
          "command_all": "RUN [\"LABEL\",\"org.opencontainers.image.url=https://megabyte.space\"]",
          "system_commands": ["[\"LABEL\",\"org.opencontainers.image.url=https://megabyte.space\"]"],
          "comment": "buildkit.dockerfile.v0"
        },
        {
          "type": "RUN",
          "time": "2021-06-16T21:23:27Z",
          "is_nop": false,
          "is_exec_form": true,
          "local_image_exists": false,
          "layer_index": 0,
          "size": 0,
          "command_snippet": "RUN [\"LABEL\",\"org.opencontainers.image.vendo...",
          "command_all": "RUN [\"LABEL\",\"org.opencontainers.image.vendor=Megabyte\",\"Labs\"]",
          "system_commands": ["[\"LABEL\",\"org.opencontainers.image.vendor=Megabyte\",\"Labs\"]"],
          "comment": "buildkit.dockerfile.v0"
        },
        {
          "type": "RUN",
          "time": "2021-06-16T21:23:27Z",
          "is_nop": false,
          "is_exec_form": true,
          "local_image_exists": false,
          "layer_index": 0,
          "size": 0,
          "command_snippet": "RUN [\"LABEL\",\"org.opencontainers.image.versi...",
          "command_all": "RUN [\"LABEL\",\"org.opencontainers.image.version=1.7.3\"]",
          "system_commands": ["[\"LABEL\",\"org.opencontainers.image.version=1.7.3\"]"],
          "comment": "buildkit.dockerfile.v0"
        },
        {
          "type": "RUN",
          "time": "2021-06-16T21:23:27Z",
          "is_last_instruction": true,
          "is_nop": false,
          "is_exec_form": true,
          "local_image_exists": true,
          "layer_index": 0,
          "size": 0,
          "command_snippet": "RUN [\"LABEL\",\"space.megabyte.type=ci-pipelin...",
          "command_all": "RUN [\"LABEL\",\"space.megabyte.type=ci-pipeline\"]",
          "system_commands": ["[\"LABEL\",\"space.megabyte.type=ci-pipeline\"]"],
          "comment": "buildkit.dockerfile.v0",
          "raw_tags": ["megabytelabs/packer:1.7.3", "megabytelabs/packer:latest"]
        }
      ]
    }
  ]
}
