{
  "version": "1.0",
  "engine": "darwin|Transformer|1.35.0|6eca3ad331720c31a7e398ffaf002a896dc9a70a|2021-04-15_02:48:03AM",
  "containerized": false,
  "host_distro": {
    "name": "",
    "version": "",
    "display_name": "Catalina (10.15.6)"
  },
  "type": "build",
  "state": "done",
  "target_reference": "megabytelabs/mdl:latest",
  "system": {
    "type": "Linux",
    "release": "5.10.25-linuxkit",
    "distro": {
      "name": "Alpine Linux",
      "version": "3.13.5",
      "display_name": "Alpine Linux v3.13"
    }
  },
  "source_image": {
    "identity": {
      "id": "sha256:66e812a02eec4ae0c3a390b87ad043ce295a6dde5e2398213ea9e5dd66274509",
      "tags": ["0.0.22", "latest"],
      "names": ["megabytelabs/mdl:0.0.22", "megabytelabs/mdl:latest"]
    },
    "size": 75365513,
    "size_human": "75 MB",
    "create_time": "2021-05-07T06:58:59Z",
    "docker_version": "",
    "architecture": "amd64",
    "os": "linux",
    "labels": {
      "maintainer": "Megabyte Labs <help@megabyte.space",
      "org.opencontainers.image.authors": "Brian Zalewski <brian@megabyte.space>",
      "org.opencontainers.image.created": "2021-04-22T20:49:33+07:00",
      "org.opencontainers.image.description": "An incredibly compact mdl container that you can use in CI environments as well as from the command-line as a one-liner",
      "org.opencontainers.image.documentation": "https://gitlab.com/megabyte-labs/dockerfile/ci-pipeline/mdl/-/blob/master/README.md",
      "org.opencontainers.image.licenses": "MIT",
      "org.opencontainers.image.revision": "1213bf3e5369e5a2cca63c7780a625b9e6ff6484",
      "org.opencontainers.image.source": "https://gitlab.com/megabyte-labs/dockerfile/ci-pipeline/mdl.git",
      "org.opencontainers.image.url": "https://megabyte.space",
      "org.opencontainers.image.vendor": "Megabyte Labs",
      "org.opencontainers.image.version": "0.0.22",
      "space.megabyte.type": "ci-pipeline"
    },
    "env_vars": [
      "PATH=/usr/local/bundle/bin:/usr/local/sbin:/usr/local/bin:/usr/sbin:/usr/bin:/sbin:/bin",
      "LANG=C.UTF-8",
      "RUBY_MAJOR=3.0",
      "RUBY_VERSION=3.0.1",
      "RUBY_DOWNLOAD_SHA256=d06bccd382d03724b69f674bc46cd6957ba08ed07522694ce44b9e8ffc9c48e2",
      "GEM_HOME=/usr/local/bundle",
      "BUNDLE_SILENCE_ROOT_WARNING=1",
      "BUNDLE_APP_CONFIG=/usr/local/bundle"
    ]
  },
  "minified_image_size": 46596111,
  "minified_image_size_human": "47 MB",
  "minified_image": "megabytelabs/mdl:slim",
  "minified_image_has_data": true,
  "minified_by": 1.6174206684330372,
  "artifact_location": "/tmp/docker-slim-state/.docker-slim-state/images/66e812a02eec4ae0c3a390b87ad043ce295a6dde5e2398213ea9e5dd66274509/artifacts",
  "container_report_name": "creport.json",
  "seccomp_profile_name": "megabytelabs-mdl-seccomp.json",
  "apparmor_profile_name": "megabytelabs-mdl-apparmor-profile",
  "image_stack": [
    {
      "is_top_image": true,
      "id": "sha256:66e812a02eec4ae0c3a390b87ad043ce295a6dde5e2398213ea9e5dd66274509",
      "full_name": "megabytelabs/mdl:0.0.22",
      "repo_name": "megabytelabs/mdl",
      "version_tag": "0.0.22",
      "raw_tags": ["megabytelabs/mdl:0.0.22", "megabytelabs/mdl:latest"],
      "create_time": "2021-05-07T06:58:59Z",
      "new_size": 75365513,
      "new_size_human": "75 MB",
      "instructions": [
        {
          "type": "ADD",
          "time": "2021-04-14T19:19:39Z",
          "is_nop": true,
          "local_image_exists": false,
          "layer_index": 0,
          "size": 5613158,
          "size_human": "5.6 MB",
          "params": "file:8ec69d882e7f29f0652d537557160e638168550f738d0d49f90a7ef96bf31787 in /",
          "command_snippet": "ADD file:8ec69d882e7f29f0652d537557160e63816...",
          "command_all": "ADD file:8ec69d882e7f29f0652d537557160e638168550f738d0d49f90a7ef96bf31787 /",
          "target": "/",
          "source_type": "file"
        },
        {
          "type": "CMD",
          "time": "2021-04-14T19:19:39Z",
          "is_nop": true,
          "is_exec_form": true,
          "local_image_exists": false,
          "layer_index": 0,
          "size": 0,
          "params": "[\"/bin/sh\"]",
          "command_snippet": "CMD [\"/bin/sh\"]",
          "command_all": "CMD [\"/bin/sh\"]"
        },
        {
          "type": "RUN",
          "time": "2021-04-15T03:07:29Z",
          "is_nop": false,
          "local_image_exists": false,
          "layer_index": 0,
          "size": 3907667,
          "size_human": "3.9 MB",
          "command_snippet": "RUN apk add --no-cache \t\tgmp-dev",
          "command_all": "RUN apk add --no-cache \t\tgmp-dev",
          "system_commands": ["apk add --no-cache gmp-dev"]
        },
        {
          "type": "RUN",
          "time": "2021-04-15T03:07:31Z",
          "is_nop": false,
          "local_image_exists": false,
          "layer_index": 0,
          "size": 45,
          "size_human": "45 B",
          "command_snippet": "RUN set -eux; \tmkdir -p /usr/local/etc; \t{ \t...",
          "command_all": "RUN set -eux; \tmkdir -p /usr/local/etc; \t{ \t\techo 'install: --no-document'; \t\techo 'update: --no-document'; \t} >> /usr/local/etc/gemrc",
          "system_commands": [
            "set -eux",
            "mkdir -p /usr/local/etc",
            "{ echo 'install: --no-document'",
            "echo 'update: --no-document'",
            "} >> /usr/local/etc/gemrc"
          ]
        },
        {
          "type": "ENV",
          "time": "2021-04-15T03:07:31Z",
          "is_nop": true,
          "local_image_exists": false,
          "layer_index": 0,
          "size": 0,
          "params": "LANG=C.UTF-8",
          "command_snippet": "ENV LANG=C.UTF-8",
          "command_all": "ENV LANG=C.UTF-8"
        },
        {
          "type": "ENV",
          "time": "2021-04-15T03:07:32Z",
          "is_nop": true,
          "local_image_exists": false,
          "layer_index": 0,
          "size": 0,
          "params": "RUBY_MAJOR=3.0",
          "command_snippet": "ENV RUBY_MAJOR=3.0",
          "command_all": "ENV RUBY_MAJOR=3.0"
        },
        {
          "type": "ENV",
          "time": "2021-04-15T03:07:32Z",
          "is_nop": true,
          "local_image_exists": false,
          "layer_index": 0,
          "size": 0,
          "params": "RUBY_VERSION=3.0.1",
          "command_snippet": "ENV RUBY_VERSION=3.0.1",
          "command_all": "ENV RUBY_VERSION=3.0.1"
        },
        {
          "type": "ENV",
          "time": "2021-04-15T03:07:32Z",
          "is_nop": true,
          "local_image_exists": false,
          "layer_index": 0,
          "size": 0,
          "params": "RUBY_DOWNLOAD_SHA256=d06bccd382d03724b69f674bc46cd6957ba08ed07522694ce44b9e8ffc9c48e2",
          "command_snippet": "ENV RUBY_DOWNLOAD_SHA256=d06bccd382d03724b69...",
          "command_all": "ENV RUBY_DOWNLOAD_SHA256=d06bccd382d03724b69f674bc46cd6957ba08ed07522694ce44b9e8ffc9c48e2"
        },
        {
          "type": "RUN",
          "time": "2021-04-15T03:11:25Z",
          "is_nop": false,
          "local_image_exists": false,
          "layer_index": 0,
          "size": 50518880,
          "size_human": "50 MB",
          "command_snippet": "RUN set -eux; \t\tapk add --no-cache --virtual...",
          "command_all": "RUN set -eux; \t\tapk add --no-cache --virtual .ruby-builddeps \t\tautoconf \t\tbison \t\tbzip2 \t\tbzip2-dev \t\tca-certificates \t\tcoreutils \t\tdpkg-dev dpkg \t\tgcc \t\tgdbm-dev \t\tglib-dev \t\tlibc-dev \t\tlibffi-dev \t\tlibxml2-dev \t\tlibxslt-dev \t\tlinux-headers \t\tmake \t\tncurses-dev \t\topenssl \t\topenssl-dev \t\tpatch \t\tprocps \t\treadline-dev \t\truby \t\ttar \t\txz \t\tyaml-dev \t\tzlib-dev \t; \t\twget -O ruby.tar.xz \"https://cache.ruby-lang.org/pub/ruby/${RUBY_MAJOR%-rc}/ruby-$RUBY_VERSION.tar.xz\"; \techo \"$RUBY_DOWNLOAD_SHA256 *ruby.tar.xz\" | sha256sum --check --strict; \t\tmkdir -p /usr/src/ruby; \ttar -xJf ruby.tar.xz -C /usr/src/ruby --strip-components=1; \trm ruby.tar.xz; \t\tcd /usr/src/ruby; \t\twget -O 'thread-stack-fix.patch' 'https://bugs.ruby-lang.org/attachments/download/7081/0001-thread_pthread.c-make-get_main_stack-portable-on-lin.patch'; \techo '3ab628a51d92fdf0d2b5835e93564857aea73e0c1de00313864a94a6255cb645 *thread-stack-fix.patch' | sha256sum --check --strict; \tpatch -p1 -i thread-stack-fix.patch; \trm thread-stack-fix.patch; \t\t{ \t\techo '#define ENABLE_PATH_CHECK 0'; \t\techo; \t\tcat file.c; \t} > file.c.new; \tmv file.c.new file.c; \t\tautoconf; \tgnuArch=\"$(dpkg-architecture --query DEB_BUILD_GNU_TYPE)\"; \texport ac_cv_func_isnan=yes ac_cv_func_isinf=yes; \t./configure \t\t--build=\"$gnuArch\" \t\t--disable-install-doc \t\t--enable-shared \t; \tmake -j \"$(nproc)\"; \tmake install; \t\trunDeps=\"$( \t\tscanelf --needed --nobanner --format '%n#p' --recursive /usr/local \t\t\t| tr ',' '\\n' \t\t\t| sort -u \t\t\t| awk 'system(\"[ -e /usr/local/lib/\" $1 \" ]\") == 0 { next } { print \"so:\" $1 }' \t)\"; \tapk add --no-network --virtual .ruby-rundeps \t\t$runDeps \t\tbzip2 \t\tca-certificates \t\tlibffi-dev \t\tprocps \t\tyaml-dev \t\tzlib-dev \t; \tapk del --no-network .ruby-builddeps; \t\tcd /; \trm -r /usr/src/ruby; \t! apk --no-network list --installed \t\t| grep -v '^[.]ruby-rundeps' \t\t| grep -i ruby \t; \t[ \"$(command -v ruby)\" = '/usr/local/bin/ruby' ]; \truby --version; \tgem --version; \tbundle --version",
          "system_commands": [
            "set -eux",
            "apk add --no-cache --virtual .ruby-builddeps autoconf bison bzip2 bzip2-dev ca-certificates coreutils dpkg-dev dpkg gcc gdbm-dev glib-dev libc-dev libffi-dev libxml2-dev libxslt-dev linux-headers make ncurses-dev openssl openssl-dev patch procps readline-dev ruby tar xz yaml-dev zlib-dev",
            "wget -O ruby.tar.xz \"https://cache.ruby-lang.org/pub/ruby/${RUBY_MAJOR%-rc}/ruby-$RUBY_VERSION.tar.xz\"",
            "echo \"$RUBY_DOWNLOAD_SHA256 *ruby.tar.xz\" | sha256sum --check --strict",
            "mkdir -p /usr/src/ruby",
            "tar -xJf ruby.tar.xz -C /usr/src/ruby --strip-components=1",
            "rm ruby.tar.xz",
            "cd /usr/src/ruby",
            "wget -O 'thread-stack-fix.patch' 'https://bugs.ruby-lang.org/attachments/download/7081/0001-thread_pthread.c-make-get_main_stack-portable-on-lin.patch'",
            "echo '3ab628a51d92fdf0d2b5835e93564857aea73e0c1de00313864a94a6255cb645 *thread-stack-fix.patch' | sha256sum --check --strict",
            "patch -p1 -i thread-stack-fix.patch",
            "rm thread-stack-fix.patch",
            "{ echo '#define ENABLE_PATH_CHECK 0'",
            "echo",
            "cat file.c",
            "} > file.c.new",
            "mv file.c.new file.c",
            "autoconf",
            "gnuArch=\"$(dpkg-architecture --query DEB_BUILD_GNU_TYPE)\"",
            "export ac_cv_func_isnan=yes ac_cv_func_isinf=yes",
            "./configure --build=\"$gnuArch\" --disable-install-doc --enable-shared",
            "make -j \"$(nproc)\"",
            "make install",
            "runDeps=\"$( scanelf --needed --nobanner --format '%n#p' --recursive /usr/local | tr ',' 'n' | sort -u | awk 'system(\"[ -e /usr/local/lib/\" $1 \" ]\") == 0 { next } { print \"so:\" $1 }' )\"",
            "apk add --no-network --virtual .ruby-rundeps $runDeps bzip2 ca-certificates libffi-dev procps yaml-dev zlib-dev",
            "apk del --no-network .ruby-builddeps",
            "cd /",
            "rm -r /usr/src/ruby",
            "! apk --no-network list --installed | grep -v '^[.]ruby-rundeps' | grep -i ruby",
            "[ \"$(command -v ruby)\" = '/usr/local/bin/ruby' ]",
            "ruby --version",
            "gem --version",
            "bundle --version"
          ]
        },
        {
          "type": "ENV",
          "time": "2021-04-15T03:11:26Z",
          "is_nop": true,
          "local_image_exists": false,
          "layer_index": 0,
          "size": 0,
          "params": "GEM_HOME=/usr/local/bundle",
          "command_snippet": "ENV GEM_HOME=/usr/local/bundle",
          "command_all": "ENV GEM_HOME=/usr/local/bundle"
        },
        {
          "type": "ENV",
          "time": "2021-04-15T03:11:26Z",
          "is_nop": true,
          "local_image_exists": false,
          "layer_index": 0,
          "size": 0,
          "params": "BUNDLE_SILENCE_ROOT_WARNING=1 BUNDLE_APP_CONFIG=/usr/local/bundle",
          "command_snippet": "ENV BUNDLE_SILENCE_ROOT_WARNING=1 BUNDLE_APP...",
          "command_all": "ENV BUNDLE_SILENCE_ROOT_WARNING=1 BUNDLE_APP_CONFIG=/usr/local/bundle"
        },
        {
          "type": "ENV",
          "time": "2021-04-15T03:11:26Z",
          "is_nop": true,
          "local_image_exists": false,
          "layer_index": 0,
          "size": 0,
          "params": "PATH=/usr/local/bundle/bin:/usr/local/sbin:/usr/local/bin:/usr/sbin:/usr/bin:/sbin:/bin",
          "command_snippet": "ENV PATH=/usr/local/bundle/bin:/usr/local/sb...",
          "command_all": "ENV PATH=/usr/local/bundle/bin:/usr/local/sbin:/usr/local/bin:/usr/sbin:/usr/bin:/sbin:/bin"
        },
        {
          "type": "RUN",
          "time": "2021-04-15T03:11:27Z",
          "is_nop": false,
          "local_image_exists": false,
          "layer_index": 0,
          "size": 0,
          "command_snippet": "RUN mkdir -p \"$GEM_HOME\" && \\\n\tchmod 777 \"$G...",
          "command_all": "RUN mkdir -p \"$GEM_HOME\" && \\\n\tchmod 777 \"$GEM_HOME\"",
          "system_commands": ["mkdir -p \"$GEM_HOME\"", "chmod 777 \"$GEM_HOME\""]
        },
        {
          "type": "CMD",
          "time": "2021-04-15T03:11:27Z",
          "is_nop": true,
          "is_exec_form": true,
          "local_image_exists": false,
          "layer_index": 0,
          "size": 0,
          "params": "[\"irb\"]",
          "command_snippet": "CMD [\"irb\"]",
          "command_all": "CMD [\"irb\"]"
        },
        {
          "type": "RUN",
          "time": "2021-05-07T06:58:59Z",
          "is_nop": false,
          "is_exec_form": true,
          "local_image_exists": false,
          "layer_index": 0,
          "size": 15325763,
          "size_human": "15 MB",
          "command_snippet": "RUN [\"RUN\",\"/bin/sh\",\"-c\",\"apk\",\"add\",\"--no-...",
          "command_all": "RUN [\"RUN\",\"/bin/sh\",\"-c\",\"apk\",\"add\",\"--no-cache\",\"git\",\"\\u0026\\u0026\",\"gem\",\"install\",\"mdl\",\"\\u0026\\u0026\",\"mdl\",\"--version\"]",
          "system_commands": [
            "[\"RUN\",\"/bin/sh\",\"-c\",\"apk\",\"add\",\"--no-cache\",\"git\",\"u0026u0026\",\"gem\",\"install\",\"mdl\",\"u0026u0026\",\"mdl\",\"--version\"]"
          ],
          "comment": "buildkit.dockerfile.v0"
        },
        {
          "type": "RUN",
          "time": "2021-05-07T06:58:59Z",
          "is_nop": false,
          "is_exec_form": true,
          "local_image_exists": false,
          "layer_index": 0,
          "size": 0,
          "command_snippet": "RUN [\"CMD\",\"[mdl\",\"--version]\"]",
          "command_all": "RUN [\"CMD\",\"[mdl\",\"--version]\"]",
          "system_commands": ["[\"CMD\",\"[mdl\",\"--version]\"]"],
          "comment": "buildkit.dockerfile.v0"
        },
        {
          "type": "RUN",
          "time": "2021-05-07T06:58:59Z",
          "is_nop": false,
          "is_exec_form": true,
          "local_image_exists": false,
          "layer_index": 0,
          "size": 0,
          "command_snippet": "RUN [\"ARG\",\"BUILD_DATE\"]",
          "command_all": "RUN [\"ARG\",\"BUILD_DATE\"]",
          "system_commands": ["[\"ARG\",\"BUILD_DATE\"]"],
          "comment": "buildkit.dockerfile.v0"
        },
        {
          "type": "RUN",
          "time": "2021-05-07T06:58:59Z",
          "is_nop": false,
          "is_exec_form": true,
          "local_image_exists": false,
          "layer_index": 0,
          "size": 0,
          "command_snippet": "RUN [\"ARG\",\"REVISION\"]",
          "command_all": "RUN [\"ARG\",\"REVISION\"]",
          "system_commands": ["[\"ARG\",\"REVISION\"]"],
          "comment": "buildkit.dockerfile.v0"
        },
        {
          "type": "RUN",
          "time": "2021-05-07T06:58:59Z",
          "is_nop": false,
          "is_exec_form": true,
          "local_image_exists": false,
          "layer_index": 0,
          "size": 0,
          "command_snippet": "RUN [\"ARG\",\"VERSION\"]",
          "command_all": "RUN [\"ARG\",\"VERSION\"]",
          "system_commands": ["[\"ARG\",\"VERSION\"]"],
          "comment": "buildkit.dockerfile.v0"
        },
        {
          "type": "RUN",
          "time": "2021-05-07T06:58:59Z",
          "is_nop": false,
          "is_exec_form": true,
          "local_image_exists": false,
          "layer_index": 0,
          "size": 0,
          "command_snippet": "RUN [\"LABEL\",\"maintainer=Megabyte\",\"Labs\",\"\\...",
          "command_all": "RUN [\"LABEL\",\"maintainer=Megabyte\",\"Labs\",\"\\u003chelp@megabyte.space\"]",
          "system_commands": ["[\"LABEL\",\"maintainer=Megabyte\",\"Labs\",\"u003chelp@megabyte.space\"]"],
          "comment": "buildkit.dockerfile.v0"
        },
        {
          "type": "RUN",
          "time": "2021-05-07T06:58:59Z",
          "is_nop": false,
          "is_exec_form": true,
          "local_image_exists": false,
          "layer_index": 0,
          "size": 0,
          "command_snippet": "RUN [\"LABEL\",\"org.opencontainers.image.autho...",
          "command_all": "RUN [\"LABEL\",\"org.opencontainers.image.authors=Brian\",\"Zalewski\",\"\\u003cbrian@megabyte.space\\u003e\"]",
          "system_commands": [
            "[\"LABEL\",\"org.opencontainers.image.authors=Brian\",\"Zalewski\",\"u003cbrian@megabyte.spaceu003e\"]"
          ],
          "comment": "buildkit.dockerfile.v0"
        },
        {
          "type": "RUN",
          "time": "2021-05-07T06:58:59Z",
          "is_nop": false,
          "is_exec_form": true,
          "local_image_exists": false,
          "layer_index": 0,
          "size": 0,
          "command_snippet": "RUN [\"LABEL\",\"org.opencontainers.image.creat...",
          "command_all": "RUN [\"LABEL\",\"org.opencontainers.image.created=2021-04-22T20:49:33+07:00\"]",
          "system_commands": ["[\"LABEL\",\"org.opencontainers.image.created=2021-04-22T20:49:33+07:00\"]"],
          "comment": "buildkit.dockerfile.v0"
        },
        {
          "type": "RUN",
          "time": "2021-05-07T06:58:59Z",
          "is_nop": false,
          "is_exec_form": true,
          "local_image_exists": false,
          "layer_index": 0,
          "size": 0,
          "command_snippet": "RUN [\"LABEL\",\"org.opencontainers.image.descr...",
          "command_all": "RUN [\"LABEL\",\"org.opencontainers.image.description=An\",\"incredibly\",\"compact\",\"mdl\",\"container\",\"that\",\"you\",\"can\",\"use\",\"in\",\"CI\",\"environments\",\"as\",\"well\",\"as\",\"from\",\"the\",\"command-line\",\"as\",\"a\",\"one-liner\"]",
          "system_commands": [
            "[\"LABEL\",\"org.opencontainers.image.description=An\",\"incredibly\",\"compact\",\"mdl\",\"container\",\"that\",\"you\",\"can\",\"use\",\"in\",\"CI\",\"environments\",\"as\",\"well\",\"as\",\"from\",\"the\",\"command-line\",\"as\",\"a\",\"one-liner\"]"
          ],
          "comment": "buildkit.dockerfile.v0"
        },
        {
          "type": "RUN",
          "time": "2021-05-07T06:58:59Z",
          "is_nop": false,
          "is_exec_form": true,
          "local_image_exists": false,
          "layer_index": 0,
          "size": 0,
          "command_snippet": "RUN [\"LABEL\",\"org.opencontainers.image.docum...",
          "command_all": "RUN [\"LABEL\",\"org.opencontainers.image.documentation=https://gitlab.com/megabyte-labs/dockerfile/ci-pipeline/mdl/-/blob/master/README.md\"]",
          "system_commands": [
            "[\"LABEL\",\"org.opencontainers.image.documentation=https://gitlab.com/megabyte-labs/dockerfile/ci-pipeline/mdl/-/blob/master/README.md\"]"
          ],
          "comment": "buildkit.dockerfile.v0"
        },
        {
          "type": "RUN",
          "time": "2021-05-07T06:58:59Z",
          "is_nop": false,
          "is_exec_form": true,
          "local_image_exists": false,
          "layer_index": 0,
          "size": 0,
          "command_snippet": "RUN [\"LABEL\",\"org.opencontainers.image.licen...",
          "command_all": "RUN [\"LABEL\",\"org.opencontainers.image.licenses=MIT\"]",
          "system_commands": ["[\"LABEL\",\"org.opencontainers.image.licenses=MIT\"]"],
          "comment": "buildkit.dockerfile.v0"
        },
        {
          "type": "RUN",
          "time": "2021-05-07T06:58:59Z",
          "is_nop": false,
          "is_exec_form": true,
          "local_image_exists": false,
          "layer_index": 0,
          "size": 0,
          "command_snippet": "RUN [\"LABEL\",\"org.opencontainers.image.revis...",
          "command_all": "RUN [\"LABEL\",\"org.opencontainers.image.revision=1213bf3e5369e5a2cca63c7780a625b9e6ff6484\"]",
          "system_commands": [
            "[\"LABEL\",\"org.opencontainers.image.revision=1213bf3e5369e5a2cca63c7780a625b9e6ff6484\"]"
          ],
          "comment": "buildkit.dockerfile.v0"
        },
        {
          "type": "RUN",
          "time": "2021-05-07T06:58:59Z",
          "is_nop": false,
          "is_exec_form": true,
          "local_image_exists": false,
          "layer_index": 0,
          "size": 0,
          "command_snippet": "RUN [\"LABEL\",\"org.opencontainers.image.sourc...",
          "command_all": "RUN [\"LABEL\",\"org.opencontainers.image.source=https://gitlab.com/megabyte-labs/dockerfile/ci-pipeline/mdl.git\"]",
          "system_commands": [
            "[\"LABEL\",\"org.opencontainers.image.source=https://gitlab.com/megabyte-labs/dockerfile/ci-pipeline/mdl.git\"]"
          ],
          "comment": "buildkit.dockerfile.v0"
        },
        {
          "type": "RUN",
          "time": "2021-05-07T06:58:59Z",
          "is_nop": false,
          "is_exec_form": true,
          "local_image_exists": false,
          "layer_index": 0,
          "size": 0,
          "command_snippet": "RUN [\"LABEL\",\"org.opencontainers.image.url=h...",
          "command_all": "RUN [\"LABEL\",\"org.opencontainers.image.url=https://megabyte.space\"]",
          "system_commands": ["[\"LABEL\",\"org.opencontainers.image.url=https://megabyte.space\"]"],
          "comment": "buildkit.dockerfile.v0"
        },
        {
          "type": "RUN",
          "time": "2021-05-07T06:58:59Z",
          "is_nop": false,
          "is_exec_form": true,
          "local_image_exists": false,
          "layer_index": 0,
          "size": 0,
          "command_snippet": "RUN [\"LABEL\",\"org.opencontainers.image.vendo...",
          "command_all": "RUN [\"LABEL\",\"org.opencontainers.image.vendor=Megabyte\",\"Labs\"]",
          "system_commands": ["[\"LABEL\",\"org.opencontainers.image.vendor=Megabyte\",\"Labs\"]"],
          "comment": "buildkit.dockerfile.v0"
        },
        {
          "type": "RUN",
          "time": "2021-05-07T06:58:59Z",
          "is_nop": false,
          "is_exec_form": true,
          "local_image_exists": false,
          "layer_index": 0,
          "size": 0,
          "command_snippet": "RUN [\"LABEL\",\"org.opencontainers.image.versi...",
          "command_all": "RUN [\"LABEL\",\"org.opencontainers.image.version=0.0.22\"]",
          "system_commands": ["[\"LABEL\",\"org.opencontainers.image.version=0.0.22\"]"],
          "comment": "buildkit.dockerfile.v0"
        },
        {
          "type": "RUN",
          "time": "2021-05-07T06:58:59Z",
          "is_last_instruction": true,
          "is_nop": false,
          "is_exec_form": true,
          "local_image_exists": true,
          "layer_index": 0,
          "size": 0,
          "command_snippet": "RUN [\"LABEL\",\"space.megabyte.type=ci-pipelin...",
          "command_all": "RUN [\"LABEL\",\"space.megabyte.type=ci-pipeline\"]",
          "system_commands": ["[\"LABEL\",\"space.megabyte.type=ci-pipeline\"]"],
          "comment": "buildkit.dockerfile.v0",
          "raw_tags": ["megabytelabs/mdl:0.0.22", "megabytelabs/mdl:latest"]
        }
      ]
    }
  ]
}
