{
  "version": "1.0",
  "engine": "darwin|Transformer|1.35.0|latest|latest",
  "containerized": false,
  "host_distro": {
    "name": "",
    "version": "",
    "display_name": "Big Sur (11.3)"
  },
  "type": "build",
  "state": "done",
  "target_reference": "megabytelabs/black:latest",
  "system": {
    "type": "Linux",
    "release": "5.10.25-linuxkit",
    "distro": {
      "name": "Alpine Linux",
      "version": "3.14.0",
      "display_name": "Alpine Linux v3.14"
    }
  },
  "source_image": {
    "identity": {
      "id": "sha256:b337dbad69515654b0ae481e9847e3fa6de88c266c9ec7f09125d4ba5480d6cf",
      "tags": ["21.6.0", "latest"],
      "names": ["megabytelabs/black:21.6.0", "megabytelabs/black:latest"]
    },
    "size": 53231526,
    "size_human": "53 MB",
    "create_time": "2021-06-16T06:51:25Z",
    "docker_version": "",
    "architecture": "amd64",
    "os": "linux",
    "labels": {
      "maintainer": "Megabyte Labs <help@megabyte.space",
      "org.opencontainers.image.authors": "Brian Zalewski <brian@megabyte.space>",
      "org.opencontainers.image.created": "2021-06-16T17:56:44-04:00",
      "org.opencontainers.image.description": "A compact container with Black (a Python code formatter) installed that you can use in a CI environment as well as from the command-line with a one-liner (only 6.97971 MB compressed!)",
      "org.opencontainers.image.documentation": "https://gitlab.com/megabyte-labs/dockerfile/ci-pipeline/black/-/blob/master/README.md",
      "org.opencontainers.image.licenses": "MIT",
      "org.opencontainers.image.revision": "f4bf4f52aa6a49c54e80517d024e268847f743e0",
      "org.opencontainers.image.source": "https://gitlab.com/megabyte-labs/dockerfile/ci-pipeline/black.git",
      "org.opencontainers.image.url": "https://megabyte.space",
      "org.opencontainers.image.vendor": "Megabyte Labs",
      "org.opencontainers.image.version": "21.6.0",
      "space.megabyte.type": "ci-pipeline"
    },
    "env_vars": ["PATH=/usr/local/sbin:/usr/local/bin:/usr/sbin:/usr/bin:/sbin:/bin", "container=docker"]
  },
  "minified_image_size": 18746975,
  "minified_image_size_human": "19 MB",
  "minified_image": "megabytelabs/black:slim",
  "minified_image_has_data": true,
  "minified_by": 2.8394728216152205,
  "artifact_location": "/tmp/docker-slim-state/.docker-slim-state/images/b337dbad69515654b0ae481e9847e3fa6de88c266c9ec7f09125d4ba5480d6cf/artifacts",
  "container_report_name": "creport.json",
  "seccomp_profile_name": "megabytelabs-black-seccomp.json",
  "apparmor_profile_name": "megabytelabs-black-apparmor-profile",
  "image_stack": [
    {
      "is_top_image": true,
      "id": "sha256:b337dbad69515654b0ae481e9847e3fa6de88c266c9ec7f09125d4ba5480d6cf",
      "full_name": "megabytelabs/black:21.6.0",
      "repo_name": "megabytelabs/black",
      "version_tag": "21.6.0",
      "raw_tags": ["megabytelabs/black:21.6.0", "megabytelabs/black:latest"],
      "create_time": "2021-06-16T06:51:25Z",
      "new_size": 53231526,
      "new_size_human": "53 MB",
      "instructions": [
        {
          "type": "ADD",
          "time": "2021-06-15T22:19:37Z",
          "is_nop": true,
          "local_image_exists": false,
          "layer_index": 0,
          "size": 5595013,
          "size_human": "5.6 MB",
          "params": "file:f278386b0cef68136129f5f58c52445590a417b624d62bca158d4dc926c340df in /",
          "command_snippet": "ADD file:f278386b0cef68136129f5f58c52445590a...",
          "command_all": "ADD file:f278386b0cef68136129f5f58c52445590a417b624d62bca158d4dc926c340df /",
          "target": "/",
          "source_type": "file"
        },
        {
          "type": "CMD",
          "time": "2021-06-15T22:19:37Z",
          "is_nop": true,
          "is_exec_form": true,
          "local_image_exists": false,
          "layer_index": 0,
          "size": 0,
          "params": "[\"/bin/sh\"]",
          "command_snippet": "CMD [\"/bin/sh\"]",
          "command_all": "CMD [\"/bin/sh\"]"
        },
        {
          "type": "RUN",
          "time": "2021-06-16T06:51:23Z",
          "is_nop": false,
          "is_exec_form": true,
          "local_image_exists": false,
          "layer_index": 0,
          "size": 0,
          "command_snippet": "RUN [\"ENV\",\"container=docker\"]",
          "command_all": "RUN [\"ENV\",\"container=docker\"]",
          "system_commands": ["[\"ENV\",\"container=docker\"]"],
          "comment": "buildkit.dockerfile.v0"
        },
        {
          "type": "RUN",
          "time": "2021-06-16T06:51:23Z",
          "is_nop": false,
          "is_exec_form": true,
          "local_image_exists": false,
          "layer_index": 0,
          "size": 220,
          "size_human": "220 B",
          "command_snippet": "RUN [\"COPY\",\"/usr/bin/black\",\"/usr/bin/black...",
          "command_all": "RUN [\"COPY\",\"/usr/bin/black\",\"/usr/bin/black\"]",
          "system_commands": ["[\"COPY\",\"/usr/bin/black\",\"/usr/bin/black\"]"],
          "comment": "buildkit.dockerfile.v0"
        },
        {
          "type": "RUN",
          "time": "2021-06-16T06:51:23Z",
          "is_nop": false,
          "is_exec_form": true,
          "local_image_exists": false,
          "layer_index": 0,
          "size": 21819799,
          "size_human": "22 MB",
          "command_snippet": "RUN [\"COPY\",\"/usr/lib/python3.9/site-package...",
          "command_all": "RUN [\"COPY\",\"/usr/lib/python3.9/site-packages/\",\"/usr/lib/python3.9/site-packages/\"]",
          "system_commands": ["[\"COPY\",\"/usr/lib/python3.9/site-packages/\",\"/usr/lib/python3.9/site-packages/\"]"],
          "comment": "buildkit.dockerfile.v0"
        },
        {
          "type": "RUN",
          "time": "2021-06-16T06:51:23Z",
          "is_nop": false,
          "is_exec_form": true,
          "local_image_exists": false,
          "layer_index": 0,
          "size": 0,
          "command_snippet": "RUN [\"SHELL\",\"[/bin/ash\",\"-eo\",\"pipefail\",\"-...",
          "command_all": "RUN [\"SHELL\",\"[/bin/ash\",\"-eo\",\"pipefail\",\"-c]\"]",
          "system_commands": ["[\"SHELL\",\"[/bin/ash\",\"-eo\",\"pipefail\",\"-c]\"]"],
          "comment": "buildkit.dockerfile.v0"
        },
        {
          "type": "RUN",
          "time": "2021-06-16T06:51:25Z",
          "is_nop": false,
          "is_exec_form": true,
          "local_image_exists": false,
          "layer_index": 0,
          "size": 25816494,
          "size_human": "26 MB",
          "command_snippet": "RUN [\"RUN\",\"/bin/ash\",\"-eo\",\"pipefail\",\"-c\",...",
          "command_all": "RUN [\"RUN\",\"/bin/ash\",\"-eo\",\"pipefail\",\"-c\",\"apk\",\"--no-cache\",\"add\",\"python3~=3\",\"\\u0026\\u0026\",\"find\",\"/usr/lib/\",\"-name\",\"__pycache__\",\"-print0\",\"|\",\"xargs\",\"-0\",\"-n1\",\"rm\",\"-rf\",\"\\u0026\\u0026\",\"find\",\"/usr/lib/\",\"-name\",\"*.pyc\",\"-print0\",\"|\",\"xargs\",\"-0\",\"-n1\",\"rm\",\"-rf\"]",
          "system_commands": [
            "[\"RUN\",\"/bin/ash\",\"-eo\",\"pipefail\",\"-c\",\"apk\",\"--no-cache\",\"add\",\"python3~=3\",\"u0026u0026\",\"find\",\"/usr/lib/\",\"-name\",\"__pycache__\",\"-print0\",\"|\",\"xargs\",\"-0\",\"-n1\",\"rm\",\"-rf\",\"u0026u0026\",\"find\",\"/usr/lib/\",\"-name\",\"*.pyc\",\"-print0\",\"|\",\"xargs\",\"-0\",\"-n1\",\"rm\",\"-rf\"]"
          ],
          "comment": "buildkit.dockerfile.v0"
        },
        {
          "type": "RUN",
          "time": "2021-06-16T06:51:25Z",
          "is_nop": false,
          "is_exec_form": true,
          "local_image_exists": false,
          "layer_index": 0,
          "size": 0,
          "command_snippet": "RUN [\"WORKDIR\",\"/work\"]",
          "command_all": "RUN [\"WORKDIR\",\"/work\"]",
          "system_commands": ["[\"WORKDIR\",\"/work\"]"],
          "comment": "buildkit.dockerfile.v0"
        },
        {
          "type": "RUN",
          "time": "2021-06-16T06:51:25Z",
          "is_nop": false,
          "is_exec_form": true,
          "local_image_exists": false,
          "layer_index": 0,
          "size": 0,
          "command_snippet": "RUN [\"ENTRYPOINT\",\"[black]\"]",
          "command_all": "RUN [\"ENTRYPOINT\",\"[black]\"]",
          "system_commands": ["[\"ENTRYPOINT\",\"[black]\"]"],
          "comment": "buildkit.dockerfile.v0"
        },
        {
          "type": "RUN",
          "time": "2021-06-16T06:51:25Z",
          "is_nop": false,
          "is_exec_form": true,
          "local_image_exists": false,
          "layer_index": 0,
          "size": 0,
          "command_snippet": "RUN [\"CMD\",\"[--version]\"]",
          "command_all": "RUN [\"CMD\",\"[--version]\"]",
          "system_commands": ["[\"CMD\",\"[--version]\"]"],
          "comment": "buildkit.dockerfile.v0"
        },
        {
          "type": "RUN",
          "time": "2021-06-16T06:51:25Z",
          "is_nop": false,
          "is_exec_form": true,
          "local_image_exists": false,
          "layer_index": 0,
          "size": 0,
          "command_snippet": "RUN [\"ARG\",\"BUILD_DATE\"]",
          "command_all": "RUN [\"ARG\",\"BUILD_DATE\"]",
          "system_commands": ["[\"ARG\",\"BUILD_DATE\"]"],
          "comment": "buildkit.dockerfile.v0"
        },
        {
          "type": "RUN",
          "time": "2021-06-16T06:51:25Z",
          "is_nop": false,
          "is_exec_form": true,
          "local_image_exists": false,
          "layer_index": 0,
          "size": 0,
          "command_snippet": "RUN [\"ARG\",\"REVISION\"]",
          "command_all": "RUN [\"ARG\",\"REVISION\"]",
          "system_commands": ["[\"ARG\",\"REVISION\"]"],
          "comment": "buildkit.dockerfile.v0"
        },
        {
          "type": "RUN",
          "time": "2021-06-16T06:51:25Z",
          "is_nop": false,
          "is_exec_form": true,
          "local_image_exists": false,
          "layer_index": 0,
          "size": 0,
          "command_snippet": "RUN [\"ARG\",\"VERSION\"]",
          "command_all": "RUN [\"ARG\",\"VERSION\"]",
          "system_commands": ["[\"ARG\",\"VERSION\"]"],
          "comment": "buildkit.dockerfile.v0"
        },
        {
          "type": "RUN",
          "time": "2021-06-16T06:51:25Z",
          "is_nop": false,
          "is_exec_form": true,
          "local_image_exists": false,
          "layer_index": 0,
          "size": 0,
          "command_snippet": "RUN [\"LABEL\",\"maintainer=Megabyte\",\"Labs\",\"\\...",
          "command_all": "RUN [\"LABEL\",\"maintainer=Megabyte\",\"Labs\",\"\\u003chelp@megabyte.space\"]",
          "system_commands": ["[\"LABEL\",\"maintainer=Megabyte\",\"Labs\",\"u003chelp@megabyte.space\"]"],
          "comment": "buildkit.dockerfile.v0"
        },
        {
          "type": "RUN",
          "time": "2021-06-16T06:51:25Z",
          "is_nop": false,
          "is_exec_form": true,
          "local_image_exists": false,
          "layer_index": 0,
          "size": 0,
          "command_snippet": "RUN [\"LABEL\",\"org.opencontainers.image.autho...",
          "command_all": "RUN [\"LABEL\",\"org.opencontainers.image.authors=Brian\",\"Zalewski\",\"\\u003cbrian@megabyte.space\\u003e\"]",
          "system_commands": [
            "[\"LABEL\",\"org.opencontainers.image.authors=Brian\",\"Zalewski\",\"u003cbrian@megabyte.spaceu003e\"]"
          ],
          "comment": "buildkit.dockerfile.v0"
        },
        {
          "type": "RUN",
          "time": "2021-06-16T06:51:25Z",
          "is_nop": false,
          "is_exec_form": true,
          "local_image_exists": false,
          "layer_index": 0,
          "size": 0,
          "command_snippet": "RUN [\"LABEL\",\"org.opencontainers.image.creat...",
          "command_all": "RUN [\"LABEL\",\"org.opencontainers.image.created=2021-06-16T17:56:44-04:00\"]",
          "system_commands": ["[\"LABEL\",\"org.opencontainers.image.created=2021-06-16T17:56:44-04:00\"]"],
          "comment": "buildkit.dockerfile.v0"
        },
        {
          "type": "RUN",
          "time": "2021-06-16T06:51:25Z",
          "is_nop": false,
          "is_exec_form": true,
          "local_image_exists": false,
          "layer_index": 0,
          "size": 0,
          "command_snippet": "RUN [\"LABEL\",\"org.opencontainers.image.descr...",
          "command_all": "RUN [\"LABEL\",\"org.opencontainers.image.description=A\",\"compact\",\"container\",\"with\",\"Black\",\"(a\",\"Python\",\"code\",\"formatter)\",\"installed\",\"that\",\"you\",\"can\",\"use\",\"in\",\"a\",\"CI\",\"environment\",\"as\",\"well\",\"as\",\"from\",\"the\",\"command-line\",\"with\",\"a\",\"one-liner\",\"(only\",\"6.97971\",\"MB\",\"compressed!)\"]",
          "system_commands": [
            "[\"LABEL\",\"org.opencontainers.image.description=A\",\"compact\",\"container\",\"with\",\"Black\",\"(a\",\"Python\",\"code\",\"formatter)\",\"installed\",\"that\",\"you\",\"can\",\"use\",\"in\",\"a\",\"CI\",\"environment\",\"as\",\"well\",\"as\",\"from\",\"the\",\"command-line\",\"with\",\"a\",\"one-liner\",\"(only\",\"6.97971\",\"MB\",\"compressed!)\"]"
          ],
          "comment": "buildkit.dockerfile.v0"
        },
        {
          "type": "RUN",
          "time": "2021-06-16T06:51:25Z",
          "is_nop": false,
          "is_exec_form": true,
          "local_image_exists": false,
          "layer_index": 0,
          "size": 0,
          "command_snippet": "RUN [\"LABEL\",\"org.opencontainers.image.docum...",
          "command_all": "RUN [\"LABEL\",\"org.opencontainers.image.documentation=https://gitlab.com/megabyte-labs/dockerfile/ci-pipeline/black/-/blob/master/README.md\"]",
          "system_commands": [
            "[\"LABEL\",\"org.opencontainers.image.documentation=https://gitlab.com/megabyte-labs/dockerfile/ci-pipeline/black/-/blob/master/README.md\"]"
          ],
          "comment": "buildkit.dockerfile.v0"
        },
        {
          "type": "RUN",
          "time": "2021-06-16T06:51:25Z",
          "is_nop": false,
          "is_exec_form": true,
          "local_image_exists": false,
          "layer_index": 0,
          "size": 0,
          "command_snippet": "RUN [\"LABEL\",\"org.opencontainers.image.licen...",
          "command_all": "RUN [\"LABEL\",\"org.opencontainers.image.licenses=MIT\"]",
          "system_commands": ["[\"LABEL\",\"org.opencontainers.image.licenses=MIT\"]"],
          "comment": "buildkit.dockerfile.v0"
        },
        {
          "type": "RUN",
          "time": "2021-06-16T06:51:25Z",
          "is_nop": false,
          "is_exec_form": true,
          "local_image_exists": false,
          "layer_index": 0,
          "size": 0,
          "command_snippet": "RUN [\"LABEL\",\"org.opencontainers.image.revis...",
          "command_all": "RUN [\"LABEL\",\"org.opencontainers.image.revision=f4bf4f52aa6a49c54e80517d024e268847f743e0\"]",
          "system_commands": [
            "[\"LABEL\",\"org.opencontainers.image.revision=f4bf4f52aa6a49c54e80517d024e268847f743e0\"]"
          ],
          "comment": "buildkit.dockerfile.v0"
        },
        {
          "type": "RUN",
          "time": "2021-06-16T06:51:25Z",
          "is_nop": false,
          "is_exec_form": true,
          "local_image_exists": false,
          "layer_index": 0,
          "size": 0,
          "command_snippet": "RUN [\"LABEL\",\"org.opencontainers.image.sourc...",
          "command_all": "RUN [\"LABEL\",\"org.opencontainers.image.source=https://gitlab.com/megabyte-labs/dockerfile/ci-pipeline/black.git\"]",
          "system_commands": [
            "[\"LABEL\",\"org.opencontainers.image.source=https://gitlab.com/megabyte-labs/dockerfile/ci-pipeline/black.git\"]"
          ],
          "comment": "buildkit.dockerfile.v0"
        },
        {
          "type": "RUN",
          "time": "2021-06-16T06:51:25Z",
          "is_nop": false,
          "is_exec_form": true,
          "local_image_exists": false,
          "layer_index": 0,
          "size": 0,
          "command_snippet": "RUN [\"LABEL\",\"org.opencontainers.image.url=h...",
          "command_all": "RUN [\"LABEL\",\"org.opencontainers.image.url=https://megabyte.space\"]",
          "system_commands": ["[\"LABEL\",\"org.opencontainers.image.url=https://megabyte.space\"]"],
          "comment": "buildkit.dockerfile.v0"
        },
        {
          "type": "RUN",
          "time": "2021-06-16T06:51:25Z",
          "is_nop": false,
          "is_exec_form": true,
          "local_image_exists": false,
          "layer_index": 0,
          "size": 0,
          "command_snippet": "RUN [\"LABEL\",\"org.opencontainers.image.vendo...",
          "command_all": "RUN [\"LABEL\",\"org.opencontainers.image.vendor=Megabyte\",\"Labs\"]",
          "system_commands": ["[\"LABEL\",\"org.opencontainers.image.vendor=Megabyte\",\"Labs\"]"],
          "comment": "buildkit.dockerfile.v0"
        },
        {
          "type": "RUN",
          "time": "2021-06-16T06:51:25Z",
          "is_nop": false,
          "is_exec_form": true,
          "local_image_exists": false,
          "layer_index": 0,
          "size": 0,
          "command_snippet": "RUN [\"LABEL\",\"org.opencontainers.image.versi...",
          "command_all": "RUN [\"LABEL\",\"org.opencontainers.image.version=21.6.0\"]",
          "system_commands": ["[\"LABEL\",\"org.opencontainers.image.version=21.6.0\"]"],
          "comment": "buildkit.dockerfile.v0"
        },
        {
          "type": "RUN",
          "time": "2021-06-16T06:51:25Z",
          "is_last_instruction": true,
          "is_nop": false,
          "is_exec_form": true,
          "local_image_exists": true,
          "layer_index": 0,
          "size": 0,
          "command_snippet": "RUN [\"LABEL\",\"space.megabyte.type=ci-pipelin...",
          "command_all": "RUN [\"LABEL\",\"space.megabyte.type=ci-pipeline\"]",
          "system_commands": ["[\"LABEL\",\"space.megabyte.type=ci-pipeline\"]"],
          "comment": "buildkit.dockerfile.v0",
          "raw_tags": ["megabytelabs/black:21.6.0", "megabytelabs/black:latest"]
        }
      ]
    }
  ]
}
