{
  "version": "1.0",
  "engine": "linux|Transformer|1.37.3|97eb3c8c7f8c4e295a26c13882feb3f0539ab50f|2021-12-10_09:37:29AM",
  "containerized": false,
  "host_distro": {
    "name": "Ubuntu",
    "version": "20.04",
    "display_name": "Ubuntu 20.04.3 LTS"
  },
  "type": "build",
  "state": "done",
  "target_reference": "codeclimate/codeclimate-golint",
  "system": {
    "type": "Linux",
    "release": "5.13.0-28-generic",
    "distro": {
      "name": "Alpine Linux",
      "version": "3.15.0",
      "display_name": "Alpine Linux v3.15"
    }
  },
  "source_image": {
    "identity": {
      "id": "sha256:e7f1a7bad5ac95eefc5b55f4f329f1b2a03bfbe54efe59ff2d4c237a64e6dd33",
      "tags": ["latest"],
      "names": ["codeclimate/codeclimate-golint:latest"]
    },
    "size": 320899109,
    "size_human": "321 MB",
    "create_time": "2022-02-14T11:01:01Z",
    "docker_version": "20.10.7",
    "architecture": "amd64",
    "user": "app",
    "os": "linux",
    "volumes": ["/code"],
    "labels": {
      "maintainer": "Megabyte Labs <help@megabyte.space>",
      "org.opencontainers.image.authors": "Brian Zalewski <brian@megabyte.space>",
      "org.opencontainers.image.created": "",
      "org.opencontainers.image.description": "Code Climate engine for Golint",
      "org.opencontainers.image.documentation": "https://gitlab.com/megabyte-labs/docker/codeclimate/golint/-/blob/master/README.md",
      "org.opencontainers.image.licenses": "MIT",
      "org.opencontainers.image.revision": "",
      "org.opencontainers.image.source": "https://gitlab.com/megabyte-labs/docker/codeclimate/golint.git",
      "org.opencontainers.image.url": "https://megabyte.space",
      "org.opencontainers.image.vendor": "Megabyte Labs",
      "org.opencontainers.image.version": "",
      "space.megabyte.type": "code-climate"
    },
    "env_vars": [
      "PATH=/go/bin:/usr/local/go/bin:/usr/local/sbin:/usr/local/bin:/usr/sbin:/usr/bin:/sbin:/bin",
      "GOLANG_VERSION=1.17.6",
      "GOPATH=/go"
    ],
    "container_entry": {
      "exe_path": ""
    }
  },
  "minified_image_size": 23991490,
  "minified_image_size_human": "24 MB",
  "minified_image": "codeclimate/codeclimate-golint:slim",
  "minified_image_has_data": true,
  "minified_by": 13.375538951519893,
  "artifact_location": "/tmp/docker-slim-state/.docker-slim-state/images/e7f1a7bad5ac95eefc5b55f4f329f1b2a03bfbe54efe59ff2d4c237a64e6dd33/artifacts",
  "container_report_name": "creport.json",
  "seccomp_profile_name": "codeclimate-codeclimate-golint-seccomp.json",
  "apparmor_profile_name": "codeclimate-codeclimate-golint-apparmor-profile",
  "image_stack": [
    {
      "is_top_image": false,
      "id": "sha256:e8fc0c5ad389ed61e267136a87f4f61694203c6cbcba947097106e1135a2cb38",
      "full_name": "golang:1.17.6-alpine3.15",
      "repo_name": "golang",
      "version_tag": "1.17.6-alpine3.15",
      "raw_tags": ["golang:1.17.6-alpine3.15"],
      "create_time": "2022-01-06T22:23:26Z",
      "new_size": 315348151,
      "new_size_human": "315 MB",
      "instructions": [
        {
          "type": "ADD",
          "time": "2021-11-24T20:19:40Z",
          "is_nop": true,
          "local_image_exists": false,
          "layer_index": 0,
          "size": 5585772,
          "size_human": "5.6 MB",
          "params": "file:9233f6f2237d79659a9521f7e390df217cec49f1a8aa3a12147bbca1956acdb9 in /",
          "command_snippet": "ADD file:9233f6f2237d79659a9521f7e390df217ce...",
          "command_all": "ADD file:9233f6f2237d79659a9521f7e390df217cec49f1a8aa3a12147bbca1956acdb9 /",
          "target": "/",
          "source_type": "file"
        },
        {
          "type": "CMD",
          "time": "2021-11-24T20:19:40Z",
          "is_nop": true,
          "is_exec_form": true,
          "local_image_exists": false,
          "layer_index": 0,
          "size": 0,
          "params": "[\"/bin/sh\"]\n",
          "command_snippet": "CMD [\"/bin/sh\"]\n",
          "command_all": "CMD [\"/bin/sh\"]\n"
        },
        {
          "type": "RUN",
          "time": "2021-11-30T04:21:45Z",
          "is_nop": false,
          "local_image_exists": false,
          "layer_index": 0,
          "size": 518796,
          "size_human": "519 kB",
          "command_snippet": "RUN apk add --no-cache ca-certificates",
          "command_all": "RUN apk add --no-cache ca-certificates",
          "system_commands": ["apk add --no-cache ca-certificates"]
        },
        {
          "type": "RUN",
          "time": "2021-11-30T04:21:46Z",
          "is_nop": false,
          "local_image_exists": false,
          "layer_index": 0,
          "size": 17,
          "size_human": "17 B",
          "command_snippet": "RUN [ ! -e /etc/nsswitch.conf ] && \\\n\techo '...",
          "command_all": "RUN [ ! -e /etc/nsswitch.conf ] && \\\n\techo 'hosts: files dns' > /etc/nsswitch.conf",
          "system_commands": [
            "[ ! -e /etc/nsswitch.conf ]",
            "echo 'hosts: files dns' > /etc/nsswitch.conf"
          ]
        },
        {
          "type": "ENV",
          "time": "2021-11-30T04:21:47Z",
          "is_nop": true,
          "local_image_exists": false,
          "layer_index": 0,
          "size": 0,
          "params": "PATH=/usr/local/go/bin:/usr/local/sbin:/usr/local/bin:/usr/sbin:/usr/bin:/sbin:/bin",
          "command_snippet": "ENV PATH=/usr/local/go/bin:/usr/local/sbin:/...",
          "command_all": "ENV PATH=/usr/local/go/bin:/usr/local/sbin:/usr/local/bin:/usr/sbin:/usr/bin:/sbin:/bin"
        },
        {
          "type": "ENV",
          "time": "2022-01-06T22:21:15Z",
          "is_nop": true,
          "local_image_exists": false,
          "layer_index": 0,
          "size": 0,
          "params": "GOLANG_VERSION=1.17.6",
          "command_snippet": "ENV GOLANG_VERSION=1.17.6",
          "command_all": "ENV GOLANG_VERSION=1.17.6"
        },
        {
          "type": "RUN",
          "time": "2022-01-06T22:23:24Z",
          "is_nop": false,
          "local_image_exists": false,
          "layer_index": 0,
          "size": 309243566,
          "size_human": "309 MB",
          "command_snippet": "RUN set -eux; \tapk add --no-cache --virtual ...",
          "command_all": "RUN set -eux; \tapk add --no-cache --virtual .fetch-deps gnupg; \tarch=\"$(apk --print-arch)\"; \turl=; \tcase \"$arch\" in \t\t'x86_64') \t\t\texport GOARCH='amd64' GOOS='linux'; \t\t\t;; \t\t'armhf') \t\t\texport GOARCH='arm' GOARM='6' GOOS='linux'; \t\t\t;; \t\t'armv7') \t\t\texport GOARCH='arm' GOARM='7' GOOS='linux'; \t\t\t;; \t\t'aarch64') \t\t\texport GOARCH='arm64' GOOS='linux'; \t\t\t;; \t\t'x86') \t\t\texport GO386='softfloat' GOARCH='386' GOOS='linux'; \t\t\t;; \t\t'ppc64le') \t\t\texport GOARCH='ppc64le' GOOS='linux'; \t\t\t;; \t\t's390x') \t\t\texport GOARCH='s390x' GOOS='linux'; \t\t\t;; \t\t*) echo >&2 \"error: unsupported architecture '$arch' (likely packaging update needed)\"; exit 1 ;; \tesac; \tbuild=; \tif [ -z \"$url\" ]; then \t\tbuild=1; \t\turl='https://dl.google.com/go/go1.17.6.src.tar.gz'; \t\tsha256='4dc1bbf3ff61f0c1ff2b19355e6d88151a70126268a47c761477686ef94748c8'; \tfi; \t\twget -O go.tgz.asc \"$url.asc\"; \twget -O go.tgz \"$url\"; \techo \"$sha256 *go.tgz\" | sha256sum -c -; \t\tGNUPGHOME=\"$(mktemp -d)\"; export GNUPGHOME; \tgpg --batch --keyserver keyserver.ubuntu.com --recv-keys 'EB4C 1BFD 4F04 2F6D DDCC  EC91 7721 F63B D38B 4796'; \tgpg --batch --keyserver keyserver.ubuntu.com --recv-keys '2F52 8D36 D67B 69ED F998  D857 78BD 6547 3CB3 BD13'; \tgpg --batch --verify go.tgz.asc go.tgz; \tgpgconf --kill all; \trm -rf \"$GNUPGHOME\" go.tgz.asc; \t\ttar -C /usr/local -xzf go.tgz; \trm go.tgz; \t\tif [ -n \"$build\" ]; then \t\tapk add --no-cache --virtual .build-deps \t\t\tbash \t\t\tgcc \t\t\tgo \t\t\tmusl-dev \t\t; \t\t\t\t( \t\t\tcd /usr/local/go/src; \t\t\texport GOROOT_BOOTSTRAP=\"$(go env GOROOT)\" GOHOSTOS=\"$GOOS\" GOHOSTARCH=\"$GOARCH\"; \t\t\t./make.bash; \t\t); \t\t\t\tapk del --no-network .build-deps; \t\t\t\tgo install std; \t\t\t\trm -rf \t\t\t/usr/local/go/pkg/*/cmd \t\t\t/usr/local/go/pkg/bootstrap \t\t\t/usr/local/go/pkg/obj \t\t\t/usr/local/go/pkg/tool/*/api \t\t\t/usr/local/go/pkg/tool/*/go_bootstrap \t\t\t/usr/local/go/src/cmd/dist/dist \t\t; \tfi; \t\tapk del --no-network .fetch-deps; \t\tgo version",
          "system_commands": [
            "set -eux",
            "apk add --no-cache --virtual .fetch-deps gnupg",
            "arch=\"$(apk --print-arch)\"",
            "url=",
            "case \"$arch\" in 'x86_64') export GOARCH='amd64' GOOS='linux'",
            "",
            "",
            "'armhf') export GOARCH='arm' GOARM='6' GOOS='linux'",
            "",
            "",
            "'armv7') export GOARCH='arm' GOARM='7' GOOS='linux'",
            "",
            "",
            "'aarch64') export GOARCH='arm64' GOOS='linux'",
            "",
            "",
            "'x86') export GO386='softfloat' GOARCH='386' GOOS='linux'",
            "",
            "",
            "'ppc64le') export GOARCH='ppc64le' GOOS='linux'",
            "",
            "",
            "'s390x') export GOARCH='s390x' GOOS='linux'",
            "",
            "",
            "*) echo >&2 \"error: unsupported architecture '$arch' (likely packaging update needed)\"",
            "exit 1",
            "",
            "esac",
            "build=",
            "if [ -z \"$url\" ]",
            "then build=1",
            "url='https://dl.google.com/go/go1.17.6.src.tar.gz'",
            "sha256='4dc1bbf3ff61f0c1ff2b19355e6d88151a70126268a47c761477686ef94748c8'",
            "fi",
            "wget -O go.tgz.asc \"$url.asc\"",
            "wget -O go.tgz \"$url\"",
            "echo \"$sha256 *go.tgz\" | sha256sum -c -",
            "GNUPGHOME=\"$(mktemp -d)\"",
            "export GNUPGHOME",
            "gpg --batch --keyserver keyserver.ubuntu.com --recv-keys 'EB4C 1BFD 4F04 2F6D DDCC  EC91 7721 F63B D38B 4796'",
            "gpg --batch --keyserver keyserver.ubuntu.com --recv-keys '2F52 8D36 D67B 69ED F998  D857 78BD 6547 3CB3 BD13'",
            "gpg --batch --verify go.tgz.asc go.tgz",
            "gpgconf --kill all",
            "rm -rf \"$GNUPGHOME\" go.tgz.asc",
            "tar -C /usr/local -xzf go.tgz",
            "rm go.tgz",
            "if [ -n \"$build\" ]",
            "then apk add --no-cache --virtual .build-deps bash gcc go musl-dev",
            "( cd /usr/local/go/src",
            "export GOROOT_BOOTSTRAP=\"$(go env GOROOT)\" GOHOSTOS=\"$GOOS\" GOHOSTARCH=\"$GOARCH\"",
            "./make.bash",
            ")",
            "apk del --no-network .build-deps",
            "go install std",
            "rm -rf /usr/local/go/pkg/*/cmd /usr/local/go/pkg/bootstrap /usr/local/go/pkg/obj /usr/local/go/pkg/tool/*/api /usr/local/go/pkg/tool/*/go_bootstrap /usr/local/go/src/cmd/dist/dist",
            "fi",
            "apk del --no-network .fetch-deps",
            "go version"
          ]
        },
        {
          "type": "ENV",
          "time": "2022-01-06T22:23:25Z",
          "is_nop": true,
          "local_image_exists": false,
          "layer_index": 0,
          "size": 0,
          "params": "GOPATH=/go",
          "command_snippet": "ENV GOPATH=/go",
          "command_all": "ENV GOPATH=/go"
        },
        {
          "type": "ENV",
          "time": "2022-01-06T22:23:25Z",
          "is_nop": true,
          "local_image_exists": false,
          "layer_index": 0,
          "size": 0,
          "params": "PATH=/go/bin:/usr/local/go/bin:/usr/local/sbin:/usr/local/bin:/usr/sbin:/usr/bin:/sbin:/bin",
          "command_snippet": "ENV PATH=/go/bin:/usr/local/go/bin:/usr/loca...",
          "command_all": "ENV PATH=/go/bin:/usr/local/go/bin:/usr/local/sbin:/usr/local/bin:/usr/sbin:/usr/bin:/sbin:/bin"
        },
        {
          "type": "RUN",
          "time": "2022-01-06T22:23:26Z",
          "is_nop": false,
          "local_image_exists": false,
          "layer_index": 0,
          "size": 0,
          "command_snippet": "RUN mkdir -p \"$GOPATH/src\" \"$GOPATH/bin\" && ...",
          "command_all": "RUN mkdir -p \"$GOPATH/src\" \"$GOPATH/bin\" && \\\n\tchmod -R 777 \"$GOPATH\"",
          "system_commands": [
            "mkdir -p \"$GOPATH/src\" \"$GOPATH/bin\"",
            "chmod -R 777 \"$GOPATH\""
          ]
        },
        {
          "type": "WORKDIR",
          "time": "2022-01-06T22:23:26Z",
          "is_last_instruction": true,
          "is_nop": true,
          "local_image_exists": true,
          "layer_index": 0,
          "size": 0,
          "params": "/go",
          "command_snippet": "WORKDIR /go",
          "command_all": "WORKDIR /go",
          "system_commands": ["mkdir -p /go"],
          "raw_tags": ["golang:1.17.6-alpine3.15"]
        }
      ]
    },
    {
      "is_top_image": true,
      "id": "sha256:e7f1a7bad5ac95eefc5b55f4f329f1b2a03bfbe54efe59ff2d4c237a64e6dd33",
      "full_name": "codeclimate/codeclimate-golint:latest",
      "repo_name": "codeclimate/codeclimate-golint",
      "version_tag": "latest",
      "raw_tags": ["codeclimate/codeclimate-golint:latest"],
      "create_time": "2022-02-14T11:01:01Z",
      "new_size": 5550958,
      "new_size_human": "5.6 MB",
      "base_image_id": "sha256:e8fc0c5ad389ed61e267136a87f4f61694203c6cbcba947097106e1135a2cb38",
      "instructions": [
        {
          "type": "RUN",
          "time": "2022-02-09T14:40:42Z",
          "is_nop": false,
          "local_image_exists": true,
          "intermediate_image_id": "sha256:ce0ae5a025b3e5a7c9240cfde8d4fe77bdb618dd3bc4d80e50418291bf616517",
          "layer_index": 0,
          "size": 4668,
          "size_human": "4.7 kB",
          "command_snippet": "RUN adduser -u 9000 -D app",
          "command_all": "RUN adduser -u 9000 -D app",
          "system_commands": ["adduser -u 9000 -D app"]
        },
        {
          "type": "WORKDIR",
          "time": "2022-02-09T14:40:43Z",
          "is_nop": true,
          "local_image_exists": true,
          "intermediate_image_id": "sha256:cdf63526ea0d11d7ca103d2e9af5f058c1ba61aaa4cb071d1f8add28c3f8e989",
          "layer_index": 0,
          "size": 0,
          "params": "/usr/src/app",
          "command_snippet": "WORKDIR /usr/src/app",
          "command_all": "WORKDIR /usr/src/app",
          "system_commands": ["mkdir -p /usr/src/app"]
        },
        {
          "type": "COPY",
          "time": "2022-02-14T11:00:57Z",
          "is_nop": true,
          "local_image_exists": true,
          "intermediate_image_id": "sha256:14e4387c7d7f7f8609192d16b7368ee0ed4d2d0c1f5c48c4d86d38a8b86b400e",
          "layer_index": 0,
          "size": 259,
          "size_human": "259 B",
          "params": "file:e20b54d41d12e2ba53b051900330542a41517b325c519b5ba879017b20673e20 in /",
          "command_snippet": "COPY file:e20b54d41d12e2ba53b051900330542a41...",
          "command_all": "COPY file:e20b54d41d12e2ba53b051900330542a41517b325c519b5ba879017b20673e20 /",
          "target": "/",
          "source_type": "file"
        },
        {
          "type": "COPY",
          "time": "2022-02-14T11:00:57Z",
          "is_nop": true,
          "local_image_exists": true,
          "intermediate_image_id": "sha256:698db8f28d6a58923b777f566d9003c18514bd225de7e73a4ae8d77b1f40bf96",
          "layer_index": 0,
          "size": 5546031,
          "size_human": "5.5 MB",
          "params": "file:0c5c008199a7cf66f2f306845bc21204d39cec9768731e8f3a8aca474e368fd8 in ./",
          "command_snippet": "COPY file:0c5c008199a7cf66f2f306845bc21204d3...",
          "command_all": "COPY file:0c5c008199a7cf66f2f306845bc21204d39cec9768731e8f3a8aca474e368fd8 ./",
          "target": "./",
          "source_type": "file"
        },
        {
          "type": "USER",
          "time": "2022-02-14T11:00:57Z",
          "is_nop": true,
          "local_image_exists": true,
          "intermediate_image_id": "sha256:793a43b70350ece3e771c721c5fc318a4cec06e46baa2f9abb85c650818108fb",
          "layer_index": 0,
          "size": 0,
          "params": "app",
          "command_snippet": "USER app",
          "command_all": "USER app"
        },
        {
          "type": "VOLUME",
          "time": "2022-02-14T11:00:58Z",
          "is_nop": true,
          "local_image_exists": true,
          "intermediate_image_id": "sha256:443394974c0af185fab828e80e40c93046daf752b2b0d2d5c6aae7c9915853ef",
          "layer_index": 0,
          "size": 0,
          "params": "[/code]",
          "command_snippet": "VOLUME [/code]",
          "command_all": "VOLUME [/code]"
        },
        {
          "type": "CMD",
          "time": "2022-02-14T11:00:58Z",
          "is_nop": true,
          "is_exec_form": true,
          "local_image_exists": true,
          "intermediate_image_id": "sha256:1acb7fe0ef3a3fcbee687fef381205e144c801b4cd9ea7d4743f2f9ca9fb23f3",
          "layer_index": 0,
          "size": 0,
          "params": "[\"/usr/src/app/codeclimate-golint\"]\n",
          "command_snippet": "CMD [\"/usr/src/app/codeclimate-golint\"]\n",
          "command_all": "CMD [\"/usr/src/app/codeclimate-golint\"]\n"
        },
        {
          "type": "ARG",
          "time": "2022-02-14T11:00:58Z",
          "is_nop": true,
          "local_image_exists": true,
          "intermediate_image_id": "sha256:eede04477981a24edf4748ca831e5616f547ad7529918fff7de4e2b0f5b45a35",
          "layer_index": 0,
          "size": 0,
          "params": "BUILD_DATE",
          "command_snippet": "ARG BUILD_DATE",
          "command_all": "ARG BUILD_DATE"
        },
        {
          "type": "ARG",
          "time": "2022-02-14T11:00:58Z",
          "is_nop": true,
          "local_image_exists": true,
          "intermediate_image_id": "sha256:5f1a097ae042393ea11aaf708cb671a06e716356a2058bc3ac68785dcf458f1d",
          "layer_index": 0,
          "size": 0,
          "params": "REVISION",
          "command_snippet": "ARG REVISION",
          "command_all": "ARG REVISION"
        },
        {
          "type": "ARG",
          "time": "2022-02-14T11:00:58Z",
          "is_nop": true,
          "local_image_exists": true,
          "intermediate_image_id": "sha256:c4dc18aa3de225ac0fb43067a72ddf3b5624e3b41b992c370c7348f3a9643f6e",
          "layer_index": 0,
          "size": 0,
          "params": "VERSION",
          "command_snippet": "ARG VERSION",
          "command_all": "ARG VERSION"
        },
        {
          "type": "LABEL",
          "time": "2022-02-14T11:00:59Z",
          "is_nop": true,
          "local_image_exists": true,
          "intermediate_image_id": "sha256:04f85e29b4a189dac753cb372376a54efb87a061f0a0405d27b5fe0290a2247f",
          "layer_index": 0,
          "size": 0,
          "params": "maintainer=Megabyte Labs <help@megabyte.space>",
          "command_snippet": "LABEL maintainer=Megabyte Labs <help@megabyt...",
          "command_all": "LABEL maintainer=Megabyte Labs <help@megabyte.space>"
        },
        {
          "type": "LABEL",
          "time": "2022-02-14T11:00:59Z",
          "is_nop": true,
          "local_image_exists": true,
          "intermediate_image_id": "sha256:e16bee12d246da4bdd6791a33fb21b17f3e7bd5a893bd5f28e3b17e25bb924f3",
          "layer_index": 0,
          "size": 0,
          "params": "org.opencontainers.image.authors=Brian Zalewski <brian@megabyte.space>",
          "command_snippet": "LABEL org.opencontainers.image.authors=Brian...",
          "command_all": "LABEL org.opencontainers.image.authors=Brian Zalewski <brian@megabyte.space>"
        },
        {
          "type": "LABEL",
          "time": "2022-02-14T11:00:59Z",
          "is_nop": true,
          "local_image_exists": true,
          "intermediate_image_id": "sha256:3fd486431e313ed4c975164721f21cc02544a26c3523b5f1e594cac779cb35ec",
          "layer_index": 0,
          "size": 0,
          "params": "org.opencontainers.image.created=",
          "command_snippet": "LABEL org.opencontainers.image.created=",
          "command_all": "LABEL org.opencontainers.image.created="
        },
        {
          "type": "LABEL",
          "time": "2022-02-14T11:00:59Z",
          "is_nop": true,
          "local_image_exists": true,
          "intermediate_image_id": "sha256:b3da3241d5080155822735243250ec46b8d8a4a089375b1bc26ff48c023bf79b",
          "layer_index": 0,
          "size": 0,
          "params": "org.opencontainers.image.description=Code Climate engine for Golint",
          "command_snippet": "LABEL org.opencontainers.image.description=C...",
          "command_all": "LABEL org.opencontainers.image.description=Code Climate engine for Golint"
        },
        {
          "type": "LABEL",
          "time": "2022-02-14T11:00:59Z",
          "is_nop": true,
          "local_image_exists": true,
          "intermediate_image_id": "sha256:cd28058fd53e591508e021713b6d61e6dbdc45e54c1706689fff3fb75cae05ca",
          "layer_index": 0,
          "size": 0,
          "params": "org.opencontainers.image.documentation=https://gitlab.com/megabyte-labs/docker/codeclimate/golint/-/blob/master/README.md",
          "command_snippet": "LABEL org.opencontainers.image.documentation...",
          "command_all": "LABEL org.opencontainers.image.documentation=https://gitlab.com/megabyte-labs/docker/codeclimate/golint/-/blob/master/README.md"
        },
        {
          "type": "LABEL",
          "time": "2022-02-14T11:01:00Z",
          "is_nop": true,
          "local_image_exists": true,
          "intermediate_image_id": "sha256:ffbdbf92ab7c56ae8beb305c2f8aec218e0b41fa4680aea2060175caed2abce2",
          "layer_index": 0,
          "size": 0,
          "params": "org.opencontainers.image.licenses=MIT",
          "command_snippet": "LABEL org.opencontainers.image.licenses=MIT",
          "command_all": "LABEL org.opencontainers.image.licenses=MIT"
        },
        {
          "type": "LABEL",
          "time": "2022-02-14T11:01:00Z",
          "is_nop": true,
          "local_image_exists": true,
          "intermediate_image_id": "sha256:fe463a78713f700ebb696bf71ffb5379b8a290f50fdfeb98cd9a2da723312078",
          "layer_index": 0,
          "size": 0,
          "params": "org.opencontainers.image.revision=",
          "command_snippet": "LABEL org.opencontainers.image.revision=",
          "command_all": "LABEL org.opencontainers.image.revision="
        },
        {
          "type": "LABEL",
          "time": "2022-02-14T11:01:00Z",
          "is_nop": true,
          "local_image_exists": true,
          "intermediate_image_id": "sha256:4617510615bb425b357dc8cd080a8e9a05f4ed7ba58ece15a5b0aa88394ba18d",
          "layer_index": 0,
          "size": 0,
          "params": "org.opencontainers.image.source=https://gitlab.com/megabyte-labs/docker/codeclimate/golint.git",
          "command_snippet": "LABEL org.opencontainers.image.source=https:...",
          "command_all": "LABEL org.opencontainers.image.source=https://gitlab.com/megabyte-labs/docker/codeclimate/golint.git"
        },
        {
          "type": "LABEL",
          "time": "2022-02-14T11:01:00Z",
          "is_nop": true,
          "local_image_exists": true,
          "intermediate_image_id": "sha256:afa2a8504a0f1b4c0cc930429be23efa2f764cb52c5dff81037a63b62d7d6738",
          "layer_index": 0,
          "size": 0,
          "params": "org.opencontainers.image.url=https://megabyte.space",
          "command_snippet": "LABEL org.opencontainers.image.url=https://m...",
          "command_all": "LABEL org.opencontainers.image.url=https://megabyte.space"
        },
        {
          "type": "LABEL",
          "time": "2022-02-14T11:01:00Z",
          "is_nop": true,
          "local_image_exists": true,
          "intermediate_image_id": "sha256:6198297f749c6702547af6add3899545e2f4f6adcd7f49275a04773b0fdcde61",
          "layer_index": 0,
          "size": 0,
          "params": "org.opencontainers.image.vendor=Megabyte Labs",
          "command_snippet": "LABEL org.opencontainers.image.vendor=Megaby...",
          "command_all": "LABEL org.opencontainers.image.vendor=Megabyte Labs"
        },
        {
          "type": "LABEL",
          "time": "2022-02-14T11:01:01Z",
          "is_nop": true,
          "local_image_exists": true,
          "intermediate_image_id": "sha256:28f1615becd49eb1951eceb6d8b08c2bec91e589b163ba285a7952f70c7d2c7b",
          "layer_index": 0,
          "size": 0,
          "params": "org.opencontainers.image.version=",
          "command_snippet": "LABEL org.opencontainers.image.version=",
          "command_all": "LABEL org.opencontainers.image.version="
        },
        {
          "type": "LABEL",
          "time": "2022-02-14T11:01:01Z",
          "is_last_instruction": true,
          "is_nop": true,
          "local_image_exists": true,
          "layer_index": 0,
          "size": 0,
          "params": "space.megabyte.type=code-climate",
          "command_snippet": "LABEL space.megabyte.type=code-climate",
          "command_all": "LABEL space.megabyte.type=code-climate",
          "raw_tags": ["codeclimate/codeclimate-golint:latest"]
        }
      ]
    }
  ]
}
