{
  "version": "1.0",
  "engine": "linux|Transformer|1.37.3|97eb3c8c7f8c4e295a26c13882feb3f0539ab50f|2021-12-10_09:37:29AM",
  "containerized": false,
  "host_distro": {
    "name": "Ubuntu",
    "version": "20.04",
    "display_name": "Ubuntu 20.04.3 LTS"
  },
  "type": "build",
  "state": "done",
  "target_reference": "codeclimate/codeclimate-checkstyle",
  "system": {
    "type": "Linux",
    "release": "5.13.0-27-generic",
    "distro": {
      "name": "Alpine Linux",
      "version": "3.15.0",
      "display_name": "Alpine Linux v3.15"
    }
  },
  "source_image": {
    "identity": {
      "id": "sha256:ab3c5a0b1cdaffb1d205f467a9a34114d22d389c12f9093b0177d2c8a48ff631",
      "tags": ["latest"],
      "names": ["codeclimate/codeclimate-checkstyle:latest"]
    },
    "size": 461716639,
    "size_human": "462 MB",
    "create_time": "2022-02-09T13:00:46Z",
    "docker_version": "20.10.7",
    "architecture": "amd64",
    "user": "app",
    "os": "linux",
    "volumes": ["/code"],
    "labels": {
      "maintainer": "Megabyte Labs <help@megabyte.space>",
      "org.opencontainers.image.authors": "Brian Zalewski <brian@megabyte.space>",
      "org.opencontainers.image.created": "",
      "org.opencontainers.image.description": "Code Climate engine for CheckStyle",
      "org.opencontainers.image.documentation": "https://gitlab.com/megabyte-labs/docker/codeclimate/checkstyle/-/blob/master/README.md",
      "org.opencontainers.image.licenses": "MIT",
      "org.opencontainers.image.revision": "",
      "org.opencontainers.image.source": "https://gitlab.com/megabyte-labs/docker/codeclimate/checkstyle.git",
      "org.opencontainers.image.url": "https://megabyte.space",
      "org.opencontainers.image.vendor": "Megabyte Labs",
      "org.opencontainers.image.version": "",
      "space.megabyte.type": "code-climate"
    },
    "env_vars": [
      "PATH=/usr/local/bundle/bin:/usr/local/sbin:/usr/local/bin:/usr/sbin:/usr/bin:/sbin:/bin:/usr/lib/jvm/java-1.8-openjdk/jre/bin:/usr/lib/jvm/java-1.8-openjdk/bin",
      "LANG=C.UTF-8",
      "RUBY_MAJOR=3.1",
      "RUBY_VERSION=3.1.0",
      "RUBY_DOWNLOAD_SHA256=1a0e0b69b9b062b6299ff1f6c6d77b66aff3995f63d1d8b8771e7a113ec472e2",
      "GEM_HOME=/usr/local/bundle",
      "BUNDLE_SILENCE_ROOT_WARNING=1",
      "BUNDLE_APP_CONFIG=/usr/local/bundle",
      "JAVA_HOME=/usr/lib/jvm/java-1.8-openjdk/jre",
      "JAVA_VERSION=8u302",
      "JAVA_ALPINE_VERSION=8.302.08-r2"
    ],
    "container_entry": {
      "exe_path": ""
    }
  },
  "minified_image_size": 111073632,
  "minified_image_size_human": "111 MB",
  "minified_image": "codeclimate/codeclimate-checkstyle:slim",
  "minified_image_has_data": true,
  "minified_by": 4.156851907030465,
  "artifact_location": "/tmp/docker-slim-state/.docker-slim-state/images/ab3c5a0b1cdaffb1d205f467a9a34114d22d389c12f9093b0177d2c8a48ff631/artifacts",
  "container_report_name": "creport.json",
  "seccomp_profile_name": "codeclimate-codeclimate-checkstyle-seccomp.json",
  "apparmor_profile_name": "codeclimate-codeclimate-checkstyle-apparmor-profile",
  "image_stack": [
    {
      "is_top_image": false,
      "id": "sha256:4d3623b2d344961bbca718e985b81bc5ddad455bb331748835318a965bf1dfa5",
      "full_name": "ruby:3.1.0-alpine3.15",
      "repo_name": "ruby",
      "version_tag": "3.1.0-alpine3.15",
      "raw_tags": ["ruby:3.1.0-alpine3.15"],
      "create_time": "2021-12-27T20:36:48Z",
      "new_size": 70065366,
      "new_size_human": "70 MB",
      "instructions": [
        {
          "type": "ADD",
          "time": "2021-11-24T20:19:40Z",
          "is_nop": true,
          "local_image_exists": false,
          "layer_index": 0,
          "size": 5585772,
          "size_human": "5.6 MB",
          "params": "file:9233f6f2237d79659a9521f7e390df217cec49f1a8aa3a12147bbca1956acdb9 in /",
          "command_snippet": "ADD file:9233f6f2237d79659a9521f7e390df217ce...",
          "command_all": "ADD file:9233f6f2237d79659a9521f7e390df217cec49f1a8aa3a12147bbca1956acdb9 /",
          "target": "/",
          "source_type": "file"
        },
        {
          "type": "CMD",
          "time": "2021-11-24T20:19:40Z",
          "is_nop": true,
          "is_exec_form": true,
          "local_image_exists": false,
          "layer_index": 0,
          "size": 0,
          "params": "[\"/bin/sh\"]\n",
          "command_snippet": "CMD [\"/bin/sh\"]\n",
          "command_all": "CMD [\"/bin/sh\"]\n"
        },
        {
          "type": "RUN",
          "time": "2021-11-30T09:19:26Z",
          "is_nop": false,
          "local_image_exists": false,
          "layer_index": 0,
          "size": 11651282,
          "size_human": "12 MB",
          "command_snippet": "RUN set -eux; \tapk add --no-cache \t\tbzip2 \t\t...",
          "command_all": "RUN set -eux; \tapk add --no-cache \t\tbzip2 \t\tca-certificates \t\tgmp-dev \t\tlibffi-dev \t\tprocps \t\tyaml-dev \t\tzlib-dev \t;",
          "system_commands": [
            "set -eux",
            "apk add --no-cache bzip2 ca-certificates gmp-dev libffi-dev procps yaml-dev zlib-dev",
            ""
          ]
        },
        {
          "type": "RUN",
          "time": "2021-11-30T09:19:27Z",
          "is_nop": false,
          "local_image_exists": false,
          "layer_index": 0,
          "size": 45,
          "size_human": "45 B",
          "command_snippet": "RUN set -eux; \tmkdir -p /usr/local/etc; \t{ \t...",
          "command_all": "RUN set -eux; \tmkdir -p /usr/local/etc; \t{ \t\techo 'install: --no-document'; \t\techo 'update: --no-document'; \t} >> /usr/local/etc/gemrc",
          "system_commands": [
            "set -eux",
            "mkdir -p /usr/local/etc",
            "{ echo 'install: --no-document'",
            "echo 'update: --no-document'",
            "} >> /usr/local/etc/gemrc"
          ]
        },
        {
          "type": "ENV",
          "time": "2021-11-30T09:19:27Z",
          "is_nop": true,
          "local_image_exists": false,
          "layer_index": 0,
          "size": 0,
          "params": "LANG=C.UTF-8",
          "command_snippet": "ENV LANG=C.UTF-8",
          "command_all": "ENV LANG=C.UTF-8"
        },
        {
          "type": "ENV",
          "time": "2021-12-27T20:33:07Z",
          "is_nop": true,
          "local_image_exists": false,
          "layer_index": 0,
          "size": 0,
          "params": "RUBY_MAJOR=3.1",
          "command_snippet": "ENV RUBY_MAJOR=3.1",
          "command_all": "ENV RUBY_MAJOR=3.1"
        },
        {
          "type": "ENV",
          "time": "2021-12-27T20:33:07Z",
          "is_nop": true,
          "local_image_exists": false,
          "layer_index": 0,
          "size": 0,
          "params": "RUBY_VERSION=3.1.0",
          "command_snippet": "ENV RUBY_VERSION=3.1.0",
          "command_all": "ENV RUBY_VERSION=3.1.0"
        },
        {
          "type": "ENV",
          "time": "2021-12-27T20:33:08Z",
          "is_nop": true,
          "local_image_exists": false,
          "layer_index": 0,
          "size": 0,
          "params": "RUBY_DOWNLOAD_SHA256=1a0e0b69b9b062b6299ff1f6c6d77b66aff3995f63d1d8b8771e7a113ec472e2",
          "command_snippet": "ENV RUBY_DOWNLOAD_SHA256=1a0e0b69b9b062b6299...",
          "command_all": "ENV RUBY_DOWNLOAD_SHA256=1a0e0b69b9b062b6299ff1f6c6d77b66aff3995f63d1d8b8771e7a113ec472e2"
        },
        {
          "type": "RUN",
          "time": "2021-12-27T20:36:46Z",
          "is_nop": false,
          "local_image_exists": false,
          "layer_index": 0,
          "size": 52828267,
          "size_human": "53 MB",
          "command_snippet": "RUN set -eux; \t\tapk add --no-cache --virtual...",
          "command_all": "RUN set -eux; \t\tapk add --no-cache --virtual .ruby-builddeps \t\tautoconf \t\tbison \t\tbzip2 \t\tbzip2-dev \t\tca-certificates \t\tcoreutils \t\tdpkg-dev dpkg \t\tg++ \t\tgcc \t\tgdbm-dev \t\tglib-dev \t\tlibc-dev \t\tlibffi-dev \t\tlibxml2-dev \t\tlibxslt-dev \t\tlinux-headers \t\tmake \t\tncurses-dev \t\topenssl \t\topenssl-dev \t\tpatch \t\tprocps \t\treadline-dev \t\truby \t\ttar \t\txz \t\tyaml-dev \t\tzlib-dev \t; \t\twget -O ruby.tar.xz \"https://cache.ruby-lang.org/pub/ruby/${RUBY_MAJOR%-rc}/ruby-$RUBY_VERSION.tar.xz\"; \techo \"$RUBY_DOWNLOAD_SHA256 *ruby.tar.xz\" | sha256sum --check --strict; \t\tmkdir -p /usr/src/ruby; \ttar -xJf ruby.tar.xz -C /usr/src/ruby --strip-components=1; \trm ruby.tar.xz; \t\tcd /usr/src/ruby; \t\twget -O 'thread-stack-fix.patch' 'https://bugs.ruby-lang.org/attachments/download/7081/0001-thread_pthread.c-make-get_main_stack-portable-on-lin.patch'; \techo '3ab628a51d92fdf0d2b5835e93564857aea73e0c1de00313864a94a6255cb645 *thread-stack-fix.patch' | sha256sum --check --strict; \tpatch -p1 -i thread-stack-fix.patch; \trm thread-stack-fix.patch; \t\texport ac_cv_func_isnan=yes ac_cv_func_isinf=yes; \t\t{ \t\techo '#define ENABLE_PATH_CHECK 0'; \t\techo; \t\tcat file.c; \t} > file.c.new; \tmv file.c.new file.c; \t\tautoconf; \tgnuArch=\"$(dpkg-architecture --query DEB_BUILD_GNU_TYPE)\"; \t./configure \t\t--build=\"$gnuArch\" \t\t--disable-install-doc \t\t--enable-shared \t; \tmake -j \"$(nproc)\"; \tmake install; \t\trunDeps=\"$( \t\tscanelf --needed --nobanner --format '%n#p' --recursive /usr/local \t\t\t| tr ',' '\\n' \t\t\t| sort -u \t\t\t| awk 'system(\"[ -e /usr/local/lib/\" $1 \" ]\") == 0 { next } { print \"so:\" $1 }' \t)\"; \tapk add --no-network --virtual .ruby-rundeps $runDeps; \tapk del --no-network .ruby-builddeps; \t\tcd /; \trm -r /usr/src/ruby; \tif \t\tapk --no-network list --installed \t\t\t| grep -v '^[.]ruby-rundeps' \t\t\t| grep -i ruby \t; then \t\texit 1; \tfi; \t[ \"$(command -v ruby)\" = '/usr/local/bin/ruby' ]; \truby --version; \tgem --version; \tbundle --version",
          "system_commands": [
            "set -eux",
            "apk add --no-cache --virtual .ruby-builddeps autoconf bison bzip2 bzip2-dev ca-certificates coreutils dpkg-dev dpkg g++ gcc gdbm-dev glib-dev libc-dev libffi-dev libxml2-dev libxslt-dev linux-headers make ncurses-dev openssl openssl-dev patch procps readline-dev ruby tar xz yaml-dev zlib-dev",
            "wget -O ruby.tar.xz \"https://cache.ruby-lang.org/pub/ruby/${RUBY_MAJOR%-rc}/ruby-$RUBY_VERSION.tar.xz\"",
            "echo \"$RUBY_DOWNLOAD_SHA256 *ruby.tar.xz\" | sha256sum --check --strict",
            "mkdir -p /usr/src/ruby",
            "tar -xJf ruby.tar.xz -C /usr/src/ruby --strip-components=1",
            "rm ruby.tar.xz",
            "cd /usr/src/ruby",
            "wget -O 'thread-stack-fix.patch' 'https://bugs.ruby-lang.org/attachments/download/7081/0001-thread_pthread.c-make-get_main_stack-portable-on-lin.patch'",
            "echo '3ab628a51d92fdf0d2b5835e93564857aea73e0c1de00313864a94a6255cb645 *thread-stack-fix.patch' | sha256sum --check --strict",
            "patch -p1 -i thread-stack-fix.patch",
            "rm thread-stack-fix.patch",
            "export ac_cv_func_isnan=yes ac_cv_func_isinf=yes",
            "{ echo '#define ENABLE_PATH_CHECK 0'",
            "echo",
            "cat file.c",
            "} > file.c.new",
            "mv file.c.new file.c",
            "autoconf",
            "gnuArch=\"$(dpkg-architecture --query DEB_BUILD_GNU_TYPE)\"",
            "./configure --build=\"$gnuArch\" --disable-install-doc --enable-shared",
            "make -j \"$(nproc)\"",
            "make install",
            "runDeps=\"$( scanelf --needed --nobanner --format '%n#p' --recursive /usr/local | tr ',' 'n' | sort -u | awk 'system(\"[ -e /usr/local/lib/\" $1 \" ]\") == 0 { next } { print \"so:\" $1 }' )\"",
            "apk add --no-network --virtual .ruby-rundeps $runDeps",
            "apk del --no-network .ruby-builddeps",
            "cd /",
            "rm -r /usr/src/ruby",
            "if apk --no-network list --installed | grep -v '^[.]ruby-rundeps' | grep -i ruby",
            "then exit 1",
            "fi",
            "[ \"$(command -v ruby)\" = '/usr/local/bin/ruby' ]",
            "ruby --version",
            "gem --version",
            "bundle --version"
          ]
        },
        {
          "type": "ENV",
          "time": "2021-12-27T20:36:46Z",
          "is_nop": true,
          "local_image_exists": false,
          "layer_index": 0,
          "size": 0,
          "params": "GEM_HOME=/usr/local/bundle",
          "command_snippet": "ENV GEM_HOME=/usr/local/bundle",
          "command_all": "ENV GEM_HOME=/usr/local/bundle"
        },
        {
          "type": "ENV",
          "time": "2021-12-27T20:36:47Z",
          "is_nop": true,
          "local_image_exists": false,
          "layer_index": 0,
          "size": 0,
          "params": "BUNDLE_SILENCE_ROOT_WARNING=1 BUNDLE_APP_CONFIG=/usr/local/bundle",
          "command_snippet": "ENV BUNDLE_SILENCE_ROOT_WARNING=1 BUNDLE_APP...",
          "command_all": "ENV BUNDLE_SILENCE_ROOT_WARNING=1 BUNDLE_APP_CONFIG=/usr/local/bundle"
        },
        {
          "type": "ENV",
          "time": "2021-12-27T20:36:47Z",
          "is_nop": true,
          "local_image_exists": false,
          "layer_index": 0,
          "size": 0,
          "params": "PATH=/usr/local/bundle/bin:/usr/local/sbin:/usr/local/bin:/usr/sbin:/usr/bin:/sbin:/bin",
          "command_snippet": "ENV PATH=/usr/local/bundle/bin:/usr/local/sb...",
          "command_all": "ENV PATH=/usr/local/bundle/bin:/usr/local/sbin:/usr/local/bin:/usr/sbin:/usr/bin:/sbin:/bin"
        },
        {
          "type": "RUN",
          "time": "2021-12-27T20:36:47Z",
          "is_nop": false,
          "local_image_exists": false,
          "layer_index": 0,
          "size": 0,
          "command_snippet": "RUN mkdir -p \"$GEM_HOME\" && \\\n\tchmod 777 \"$G...",
          "command_all": "RUN mkdir -p \"$GEM_HOME\" && \\\n\tchmod 777 \"$GEM_HOME\"",
          "system_commands": [
            "mkdir -p \"$GEM_HOME\"",
            "chmod 777 \"$GEM_HOME\""
          ]
        },
        {
          "type": "CMD",
          "time": "2021-12-27T20:36:48Z",
          "is_last_instruction": true,
          "is_nop": true,
          "is_exec_form": true,
          "local_image_exists": true,
          "layer_index": 0,
          "size": 0,
          "params": "[\"irb\"]\n",
          "command_snippet": "CMD [\"irb\"]\n",
          "command_all": "CMD [\"irb\"]\n",
          "raw_tags": ["ruby:3.1.0-alpine3.15"]
        }
      ]
    },
    {
      "is_top_image": true,
      "id": "sha256:ab3c5a0b1cdaffb1d205f467a9a34114d22d389c12f9093b0177d2c8a48ff631",
      "full_name": "codeclimate/codeclimate-checkstyle:latest",
      "repo_name": "codeclimate/codeclimate-checkstyle",
      "version_tag": "latest",
      "raw_tags": ["codeclimate/codeclimate-checkstyle:latest"],
      "create_time": "2022-02-09T13:00:46Z",
      "new_size": 391651273,
      "new_size_human": "392 MB",
      "base_image_id": "sha256:4d3623b2d344961bbca718e985b81bc5ddad455bb331748835318a965bf1dfa5",
      "instructions": [
        {
          "type": "ENV",
          "time": "2022-02-09T12:45:00Z",
          "is_nop": true,
          "local_image_exists": true,
          "intermediate_image_id": "sha256:9a71b553ab5e36d523f35eea136bdb19a8e95899b83b6cf279b521a195dd6949",
          "layer_index": 0,
          "size": 0,
          "params": "LANG=C.UTF-8",
          "command_snippet": "ENV LANG=C.UTF-8",
          "command_all": "ENV LANG=C.UTF-8"
        },
        {
          "type": "RUN",
          "time": "2022-02-09T12:45:01Z",
          "is_nop": false,
          "local_image_exists": true,
          "intermediate_image_id": "sha256:e2381b405da77e42c01b187b5460c9cfef6f642e2c12a48c2f246968c461ac93",
          "layer_index": 0,
          "size": 4812,
          "size_human": "4.8 kB",
          "command_snippet": "RUN adduser -u 9000 -D app",
          "command_all": "RUN adduser -u 9000 -D app",
          "system_commands": ["adduser -u 9000 -D app"]
        },
        {
          "type": "RUN",
          "time": "2022-02-09T12:45:01Z",
          "is_nop": false,
          "local_image_exists": true,
          "intermediate_image_id": "sha256:6fa7506309af7d28ce019291de5f75a937f299085f5696f78cdf3f3f1ef09310",
          "layer_index": 0,
          "size": 87,
          "size_human": "87 B",
          "command_snippet": "RUN { \t\techo '#!/bin/sh'; \t\techo 'set -e'; \t...",
          "command_all": "RUN { \t\techo '#!/bin/sh'; \t\techo 'set -e'; \t\techo; \t\techo 'dirname \"$(dirname \"$(readlink -f \"$(which javac || which java)\")\")\"'; \t} > /usr/local/bin/docker-java-home && \\\n\tchmod +x /usr/local/bin/docker-java-home",
          "system_commands": [
            "{ echo '#!/bin/sh'; echo 'set -e'; echo; echo 'dirname \"$(dirname \"$(readlink -f \"$(which javac || which java)\")\")\"'; } > /usr/local/bin/docker-java-home",
            "chmod +x /usr/local/bin/docker-java-home"
          ]
        },
        {
          "type": "ENV",
          "time": "2022-02-09T12:45:02Z",
          "is_nop": true,
          "local_image_exists": true,
          "intermediate_image_id": "sha256:aa3b89fd0fe69220b4729796f0650b2a54c2f308ba80b46bc702af30e01354ea",
          "layer_index": 0,
          "size": 0,
          "params": "JAVA_HOME=/usr/lib/jvm/java-1.8-openjdk/jre",
          "command_snippet": "ENV JAVA_HOME=/usr/lib/jvm/java-1.8-openjdk/...",
          "command_all": "ENV JAVA_HOME=/usr/lib/jvm/java-1.8-openjdk/jre"
        },
        {
          "type": "ENV",
          "time": "2022-02-09T12:45:02Z",
          "is_nop": true,
          "local_image_exists": true,
          "intermediate_image_id": "sha256:c32dbe0671a9b34419b58e0186ebe6709daf0da55de0010ddf285a6e2e7cb00e",
          "layer_index": 0,
          "size": 0,
          "params": "PATH=/usr/local/bundle/bin:/usr/local/sbin:/usr/local/bin:/usr/sbin:/usr/bin:/sbin:/bin:/usr/lib/jvm/java-1.8-openjdk/jre/bin:/usr/lib/jvm/java-1.8-openjdk/bin",
          "command_snippet": "ENV PATH=/usr/local/bundle/bin:/usr/local/sb...",
          "command_all": "ENV PATH=/usr/local/bundle/bin:/usr/local/sbin:/usr/local/bin:/usr/sbin:/usr/bin:/sbin:/bin:/usr/lib/jvm/java-1.8-openjdk/jre/bin:/usr/lib/jvm/java-1.8-openjdk/bin"
        },
        {
          "type": "ENV",
          "time": "2022-02-09T12:49:11Z",
          "is_nop": true,
          "local_image_exists": true,
          "intermediate_image_id": "sha256:ac6d22dfa0e50a9e5e7d9fb94fe4890a33ac5d98de755087371fdfa122a240e2",
          "layer_index": 0,
          "size": 0,
          "params": "JAVA_VERSION=8u302",
          "command_snippet": "ENV JAVA_VERSION=8u302",
          "command_all": "ENV JAVA_VERSION=8u302"
        },
        {
          "type": "ENV",
          "time": "2022-02-09T12:49:11Z",
          "is_nop": true,
          "local_image_exists": true,
          "intermediate_image_id": "sha256:db787f52e73f0b8cd5fa521b6d75ad84bed1b6dbfbb9f115efdac731b0317a60",
          "layer_index": 0,
          "size": 0,
          "params": "JAVA_ALPINE_VERSION=8.302.08-r2",
          "command_snippet": "ENV JAVA_ALPINE_VERSION=8.302.08-r2",
          "command_all": "ENV JAVA_ALPINE_VERSION=8.302.08-r2"
        },
        {
          "type": "RUN",
          "time": "2022-02-09T12:49:30Z",
          "is_nop": false,
          "local_image_exists": true,
          "intermediate_image_id": "sha256:0c8a2e4999ceab7845d31ee318a3d38ac5275114913385e78fc93c60a0e1ff2f",
          "layer_index": 0,
          "size": 103289823,
          "size_human": "103 MB",
          "command_snippet": "RUN set -x && \\\n\tapk update && \\\n\tapk add --...",
          "command_all": "RUN set -x && \\\n\tapk update && \\\n\tapk add --no-cache --update \t\topenjdk8-jre=\"$JAVA_ALPINE_VERSION\" && \\\n\t[ \"$JAVA_HOME\" = \"$(docker-java-home)\" ]",
          "system_commands": [
            "set -x",
            "apk update",
            "apk add --no-cache --update openjdk8-jre=\"$JAVA_ALPINE_VERSION\"",
            "[ \"$JAVA_HOME\" = \"$(docker-java-home)\" ]"
          ]
        },
        {
          "type": "WORKDIR",
          "time": "2022-02-09T12:49:30Z",
          "is_nop": true,
          "local_image_exists": true,
          "intermediate_image_id": "sha256:fcd4316fd145b97683a3fd8fc6622a268d1b5a6161428bfea76eeb9ac5c2a2cf",
          "layer_index": 0,
          "size": 0,
          "params": "/usr/src/app",
          "command_snippet": "WORKDIR /usr/src/app",
          "command_all": "WORKDIR /usr/src/app",
          "system_commands": ["mkdir -p /usr/src/app"]
        },
        {
          "type": "COPY",
          "time": "2022-02-09T12:49:31Z",
          "is_nop": true,
          "local_image_exists": true,
          "intermediate_image_id": "sha256:1c23747a3f0acbee97c0bd70fc8ea375c7bc100db18cf950857a7a6407ffe03d",
          "layer_index": 0,
          "size": 121,
          "size_human": "121 B",
          "params": "file:ba4e6321890253fc2a8c7dfdae98870d29841138f6404a1bbc16e56ee958bc12 in /usr/src/app/",
          "command_snippet": "COPY file:ba4e6321890253fc2a8c7dfdae98870d29...",
          "command_all": "COPY file:ba4e6321890253fc2a8c7dfdae98870d29841138f6404a1bbc16e56ee958bc12 /usr/src/app/",
          "target": "/usr/src/app/",
          "source_type": "file"
        },
        {
          "type": "COPY",
          "time": "2022-02-09T12:49:31Z",
          "is_nop": true,
          "local_image_exists": true,
          "intermediate_image_id": "sha256:e8ed64bf996a9fef13f7521fd506f1a1665587a9ae9499b9a825d88c0e6f9681",
          "layer_index": 0,
          "size": 781,
          "size_human": "781 B",
          "params": "file:e68c46850ca5debefb8cb0d1b03f51bf12c8127ce121df891bfb2466c0599bdc in /usr/src/app/",
          "command_snippet": "COPY file:e68c46850ca5debefb8cb0d1b03f51bf12...",
          "command_all": "COPY file:e68c46850ca5debefb8cb0d1b03f51bf12c8127ce121df891bfb2466c0599bdc /usr/src/app/",
          "target": "/usr/src/app/",
          "source_type": "file"
        },
        {
          "type": "COPY",
          "time": "2022-02-09T12:49:31Z",
          "is_nop": true,
          "local_image_exists": true,
          "intermediate_image_id": "sha256:d5ff80ce33d8d913e596f5f0603bf356fc29f41602025661de18c207d3a8389a",
          "layer_index": 0,
          "size": 222,
          "size_human": "222 B",
          "params": "file:52b0b838ba53a966a8b62fc9c0d5c6b01fb82d918d79a34e611d09ac62d795be in /usr/src/app/bin/",
          "command_snippet": "COPY file:52b0b838ba53a966a8b62fc9c0d5c6b01f...",
          "command_all": "COPY file:52b0b838ba53a966a8b62fc9c0d5c6b01fb82d918d79a34e611d09ac62d795be /usr/src/app/bin/",
          "target": "/usr/src/app/bin/",
          "source_type": "file"
        },
        {
          "type": "RUN",
          "time": "2022-02-09T12:49:32Z",
          "is_nop": false,
          "local_image_exists": true,
          "intermediate_image_id": "sha256:7cc3cc5d4ae9d6c823812b812a1161f2bb90868a6b7bfb9e7f46c94996faf996",
          "layer_index": 0,
          "size": 1124,
          "size_human": "1.1 kB",
          "command_snippet": "RUN chown -R app:app /usr/src/app",
          "command_all": "RUN chown -R app:app /usr/src/app",
          "system_commands": ["chown -R app:app /usr/src/app"]
        },
        {
          "type": "RUN",
          "time": "2022-02-09T12:49:37Z",
          "is_nop": false,
          "local_image_exists": true,
          "intermediate_image_id": "sha256:77ada87c4a9d156f423bd2cc6a4a01eadbac088925736edc25df129f295f94a0",
          "layer_index": 0,
          "size": 13406239,
          "size_human": "13 MB",
          "command_snippet": "RUN ./bin/install-checkstyle.sh",
          "command_all": "RUN ./bin/install-checkstyle.sh",
          "system_commands": ["./bin/install-checkstyle.sh"]
        },
        {
          "type": "RUN",
          "time": "2022-02-09T12:51:26Z",
          "is_nop": false,
          "local_image_exists": true,
          "intermediate_image_id": "sha256:e9e64a89a33084b433e3b9a12232fcd91661564b0d0c9a5ade1989ce216810d0",
          "layer_index": 0,
          "size": 249891270,
          "size_human": "250 MB",
          "command_snippet": "RUN apk add --update make g++ git curl && \\\n...",
          "command_all": "RUN apk add --update make g++ git curl && \\\n\tbundle install",
          "system_commands": [
            "apk add --update make g++ git curl",
            "bundle install"
          ]
        },
        {
          "type": "VOLUME",
          "time": "2022-02-09T12:51:27Z",
          "is_nop": true,
          "local_image_exists": true,
          "intermediate_image_id": "sha256:46b49cd7e0cb0ecd071e3213bcef1e2ef268d84535ce81949aae515fc370c6c0",
          "layer_index": 0,
          "size": 0,
          "params": "[/code]",
          "command_snippet": "VOLUME [/code]",
          "command_all": "VOLUME [/code]"
        },
        {
          "type": "WORKDIR",
          "time": "2022-02-09T12:51:27Z",
          "is_nop": true,
          "local_image_exists": true,
          "intermediate_image_id": "sha256:084f16ecfb6224c1296a1d75f24266ef2d1262958ede15af228d25ab5ab85347",
          "layer_index": 0,
          "size": 0,
          "params": "/code",
          "command_snippet": "WORKDIR /code",
          "command_all": "WORKDIR /code",
          "system_commands": ["mkdir -p /code"]
        },
        {
          "type": "COPY",
          "time": "2022-02-09T13:00:40Z",
          "is_nop": true,
          "local_image_exists": true,
          "intermediate_image_id": "sha256:c82cd8c8e8f16cb6d37f980b9ef65ad399855fbe60aeb429faa1a1b8bb40f70a",
          "layer_index": 0,
          "size": 12528397,
          "size_human": "12 MB",
          "params": "dir:d0f600e75de7226a5c2c23a1e46af7829a92b9cb6d867ac8ada1d890959d8edf in /usr/src/app",
          "command_snippet": "COPY dir:d0f600e75de7226a5c2c23a1e46af7829a9...",
          "command_all": "COPY dir:d0f600e75de7226a5c2c23a1e46af7829a92b9cb6d867ac8ada1d890959d8edf /usr/src/app",
          "target": "/usr/src/app",
          "source_type": "dir"
        },
        {
          "type": "RUN",
          "time": "2022-02-09T13:00:42Z",
          "is_nop": false,
          "local_image_exists": true,
          "intermediate_image_id": "sha256:ab86fdc2495748cbd80fed40e61f5fe3935b685e26485f5cf03fce907b3b53c8",
          "layer_index": 0,
          "size": 12528397,
          "size_human": "12 MB",
          "command_snippet": "RUN chown -R app:app /usr/src/app",
          "command_all": "RUN chown -R app:app /usr/src/app",
          "system_commands": ["chown -R app:app /usr/src/app"]
        },
        {
          "type": "USER",
          "time": "2022-02-09T13:00:42Z",
          "is_nop": true,
          "local_image_exists": true,
          "intermediate_image_id": "sha256:ac37b63563f9d4d19a76fc4937594f6005f995fa0493e87c200b7a1fb172b0b2",
          "layer_index": 0,
          "size": 0,
          "params": "app",
          "command_snippet": "USER app",
          "command_all": "USER app"
        },
        {
          "type": "CMD",
          "time": "2022-02-09T13:00:43Z",
          "is_nop": true,
          "is_exec_form": true,
          "local_image_exists": true,
          "intermediate_image_id": "sha256:104f72e30a4d82103bfd4b92c43bffc78985622f137ca45861ba565978bafe6d",
          "layer_index": 0,
          "size": 0,
          "params": "[\"/usr/src/app/bin/codeclimate-checkstyle\"]\n",
          "command_snippet": "CMD [\"/usr/src/app/bin/codeclimate-checkstyl...",
          "command_all": "CMD [\"/usr/src/app/bin/codeclimate-checkstyle\"]\n"
        },
        {
          "type": "ARG",
          "time": "2022-02-09T13:00:43Z",
          "is_nop": true,
          "local_image_exists": true,
          "intermediate_image_id": "sha256:276555eb7a441989458a4c4a987d76bdb7472f8edd6e4b5f866134314ddb7904",
          "layer_index": 0,
          "size": 0,
          "params": "BUILD_DATE",
          "command_snippet": "ARG BUILD_DATE",
          "command_all": "ARG BUILD_DATE"
        },
        {
          "type": "ARG",
          "time": "2022-02-09T13:00:43Z",
          "is_nop": true,
          "local_image_exists": true,
          "intermediate_image_id": "sha256:b7eb939ea1b6310c15bae7d8d6c2a63862f48f29fc3b9092ab30940599441df0",
          "layer_index": 0,
          "size": 0,
          "params": "REVISION",
          "command_snippet": "ARG REVISION",
          "command_all": "ARG REVISION"
        },
        {
          "type": "ARG",
          "time": "2022-02-09T13:00:43Z",
          "is_nop": true,
          "local_image_exists": true,
          "intermediate_image_id": "sha256:996b1ff2db40e7e2986fcc61b3ceea137d698361e878c0a88d5eafe2951572be",
          "layer_index": 0,
          "size": 0,
          "params": "VERSION",
          "command_snippet": "ARG VERSION",
          "command_all": "ARG VERSION"
        },
        {
          "type": "LABEL",
          "time": "2022-02-09T13:00:43Z",
          "is_nop": true,
          "local_image_exists": true,
          "intermediate_image_id": "sha256:39a53c74fa2adb58e4ed92c8977a7009da54f384bb9bbf7ed7fbd3d4310ec9ae",
          "layer_index": 0,
          "size": 0,
          "params": "maintainer=Megabyte Labs <help@megabyte.space>",
          "command_snippet": "LABEL maintainer=Megabyte Labs <help@megabyt...",
          "command_all": "LABEL maintainer=Megabyte Labs <help@megabyte.space>"
        },
        {
          "type": "LABEL",
          "time": "2022-02-09T13:00:44Z",
          "is_nop": true,
          "local_image_exists": true,
          "intermediate_image_id": "sha256:7606ad081776c0247bdb024e4475831f71962220525539f17a50a166bb689792",
          "layer_index": 0,
          "size": 0,
          "params": "org.opencontainers.image.authors=Brian Zalewski <brian@megabyte.space>",
          "command_snippet": "LABEL org.opencontainers.image.authors=Brian...",
          "command_all": "LABEL org.opencontainers.image.authors=Brian Zalewski <brian@megabyte.space>"
        },
        {
          "type": "LABEL",
          "time": "2022-02-09T13:00:44Z",
          "is_nop": true,
          "local_image_exists": true,
          "intermediate_image_id": "sha256:89188954894af11dc729f922ae4189ece185e0d46859b51a220304da999c0665",
          "layer_index": 0,
          "size": 0,
          "params": "org.opencontainers.image.created=",
          "command_snippet": "LABEL org.opencontainers.image.created=",
          "command_all": "LABEL org.opencontainers.image.created="
        },
        {
          "type": "LABEL",
          "time": "2022-02-09T13:00:44Z",
          "is_nop": true,
          "local_image_exists": true,
          "intermediate_image_id": "sha256:4897401496e5d02b09c317ad47ce09c23293e9802dfbf98c122ff354e2c37278",
          "layer_index": 0,
          "size": 0,
          "params": "org.opencontainers.image.description=Code Climate engine for CheckStyle",
          "command_snippet": "LABEL org.opencontainers.image.description=C...",
          "command_all": "LABEL org.opencontainers.image.description=Code Climate engine for CheckStyle"
        },
        {
          "type": "LABEL",
          "time": "2022-02-09T13:00:44Z",
          "is_nop": true,
          "local_image_exists": true,
          "intermediate_image_id": "sha256:c8042c4043048759dba73c9d9514e949aac215f39ecc4ed3b8b92cdb6cd1a45f",
          "layer_index": 0,
          "size": 0,
          "params": "org.opencontainers.image.documentation=https://gitlab.com/megabyte-labs/docker/codeclimate/checkstyle/-/blob/master/README.md",
          "command_snippet": "LABEL org.opencontainers.image.documentation...",
          "command_all": "LABEL org.opencontainers.image.documentation=https://gitlab.com/megabyte-labs/docker/codeclimate/checkstyle/-/blob/master/README.md"
        },
        {
          "type": "LABEL",
          "time": "2022-02-09T13:00:45Z",
          "is_nop": true,
          "local_image_exists": true,
          "intermediate_image_id": "sha256:ffe0e46addf2b52cf882ba3997199b41bb7b2ce71998dd44306b64a3fe8bfbdd",
          "layer_index": 0,
          "size": 0,
          "params": "org.opencontainers.image.licenses=MIT",
          "command_snippet": "LABEL org.opencontainers.image.licenses=MIT",
          "command_all": "LABEL org.opencontainers.image.licenses=MIT"
        },
        {
          "type": "LABEL",
          "time": "2022-02-09T13:00:45Z",
          "is_nop": true,
          "local_image_exists": true,
          "intermediate_image_id": "sha256:c4fbeb94ca31dea9305c4ee82482f7fe12808490f2717e71cd8dc06e3ce7fb98",
          "layer_index": 0,
          "size": 0,
          "params": "org.opencontainers.image.revision=",
          "command_snippet": "LABEL org.opencontainers.image.revision=",
          "command_all": "LABEL org.opencontainers.image.revision="
        },
        {
          "type": "LABEL",
          "time": "2022-02-09T13:00:45Z",
          "is_nop": true,
          "local_image_exists": true,
          "intermediate_image_id": "sha256:0f9fb714e85766f60a363f454177df38760cc5ffb28c3419dd2756a1c4fb5d6a",
          "layer_index": 0,
          "size": 0,
          "params": "org.opencontainers.image.source=https://gitlab.com/megabyte-labs/docker/codeclimate/checkstyle.git",
          "command_snippet": "LABEL org.opencontainers.image.source=https:...",
          "command_all": "LABEL org.opencontainers.image.source=https://gitlab.com/megabyte-labs/docker/codeclimate/checkstyle.git"
        },
        {
          "type": "LABEL",
          "time": "2022-02-09T13:00:45Z",
          "is_nop": true,
          "local_image_exists": true,
          "intermediate_image_id": "sha256:d0e210ab92b555770fcf3e477e7438d43c608b49d86bb1cbe3af239f26639d9c",
          "layer_index": 0,
          "size": 0,
          "params": "org.opencontainers.image.url=https://megabyte.space",
          "command_snippet": "LABEL org.opencontainers.image.url=https://m...",
          "command_all": "LABEL org.opencontainers.image.url=https://megabyte.space"
        },
        {
          "type": "LABEL",
          "time": "2022-02-09T13:00:45Z",
          "is_nop": true,
          "local_image_exists": true,
          "intermediate_image_id": "sha256:4286804cd4564fe1b4829ef486bdada081ff49855c097a7f7d47a73095f1bcf0",
          "layer_index": 0,
          "size": 0,
          "params": "org.opencontainers.image.vendor=Megabyte Labs",
          "command_snippet": "LABEL org.opencontainers.image.vendor=Megaby...",
          "command_all": "LABEL org.opencontainers.image.vendor=Megabyte Labs"
        },
        {
          "type": "LABEL",
          "time": "2022-02-09T13:00:46Z",
          "is_nop": true,
          "local_image_exists": true,
          "intermediate_image_id": "sha256:6bf81aa0acd3772fce198068f56e46b4b58e13260c52906d2fd779bc28597518",
          "layer_index": 0,
          "size": 0,
          "params": "org.opencontainers.image.version=",
          "command_snippet": "LABEL org.opencontainers.image.version=",
          "command_all": "LABEL org.opencontainers.image.version="
        },
        {
          "type": "LABEL",
          "time": "2022-02-09T13:00:46Z",
          "is_last_instruction": true,
          "is_nop": true,
          "local_image_exists": true,
          "layer_index": 0,
          "size": 0,
          "params": "space.megabyte.type=code-climate",
          "command_snippet": "LABEL space.megabyte.type=code-climate",
          "command_all": "LABEL space.megabyte.type=code-climate",
          "raw_tags": ["codeclimate/codeclimate-checkstyle:latest"]
        }
      ]
    }
  ]
}
