{
  "version": "1.0",
  "engine": "linux|Transformer|1.37.3|97eb3c8c7f8c4e295a26c13882feb3f0539ab50f|2021-12-10_09:37:29AM",
  "containerized": false,
  "host_distro": {
    "name": "Ubuntu",
    "version": "20.04",
    "display_name": "Ubuntu 20.04.3 LTS"
  },
  "type": "build",
  "state": "done",
  "target_reference": "codeclimate/codeclimate-pep8",
  "system": {
    "type": "Linux",
    "release": "5.13.0-28-generic",
    "distro": {
      "name": "Alpine Linux",
      "version": "3.15.0",
      "display_name": "Alpine Linux v3.15"
    }
  },
  "source_image": {
    "identity": {
      "id": "sha256:a4d7799749e2995d6346bc3f00cf4205d066c244bc8c7c964be1214a36a3079a",
      "tags": ["latest"],
      "names": ["codeclimate/codeclimate-pep8:latest"]
    },
    "size": 73403039,
    "size_human": "73 MB",
    "create_time": "2022-02-14T12:46:39Z",
    "docker_version": "20.10.7",
    "architecture": "amd64",
    "user": "app",
    "os": "linux",
    "volumes": ["/code"],
    "labels": {
      "maintainer": "Megabyte Labs <help@megabyte.space>",
      "org.opencontainers.image.authors": "Brian Zalewski <brian@megabyte.space>",
      "org.opencontainers.image.created": "",
      "org.opencontainers.image.description": "Code Climate engine for Pep8",
      "org.opencontainers.image.documentation": "https://gitlab.com/megabyte-labs/docker/codeclimate/pep8/-/blob/master/README.md",
      "org.opencontainers.image.licenses": "MIT",
      "org.opencontainers.image.revision": "",
      "org.opencontainers.image.source": "https://gitlab.com/megabyte-labs/docker/codeclimate/pep8.git",
      "org.opencontainers.image.url": "https://megabyte.space",
      "org.opencontainers.image.vendor": "Megabyte Labs",
      "org.opencontainers.image.version": "",
      "space.megabyte.type": "code-climate"
    },
    "env_vars": [
      "PATH=/usr/local/sbin:/usr/local/bin:/usr/sbin:/usr/bin:/sbin:/bin"
    ],
    "container_entry": {
      "exe_path": ""
    }
  },
  "minified_image_size": 6336379,
  "minified_image_size_human": "6.3 MB",
  "minified_image": "codeclimate/codeclimate-pep8:slim",
  "minified_image_has_data": true,
  "minified_by": 11.584382657666152,
  "artifact_location": "/tmp/docker-slim-state/.docker-slim-state/images/a4d7799749e2995d6346bc3f00cf4205d066c244bc8c7c964be1214a36a3079a/artifacts",
  "container_report_name": "creport.json",
  "seccomp_profile_name": "codeclimate-codeclimate-pep8-seccomp.json",
  "apparmor_profile_name": "codeclimate-codeclimate-pep8-apparmor-profile",
  "image_stack": [
    {
      "is_top_image": false,
      "id": "sha256:c059bfaa849c4d8e4aecaeb3a10c2d9b3d85f5165c66ad3a4d937758128c4d18",
      "full_name": "alpine:3",
      "repo_name": "alpine",
      "version_tag": "3",
      "raw_tags": ["alpine:3", "alpine:3.15"],
      "create_time": "2021-11-24T20:19:40Z",
      "new_size": 5585772,
      "new_size_human": "5.6 MB",
      "instructions": [
        {
          "type": "ADD",
          "time": "2021-11-24T20:19:40Z",
          "is_nop": true,
          "local_image_exists": false,
          "layer_index": 0,
          "size": 5585772,
          "size_human": "5.6 MB",
          "params": "file:9233f6f2237d79659a9521f7e390df217cec49f1a8aa3a12147bbca1956acdb9 in /",
          "command_snippet": "ADD file:9233f6f2237d79659a9521f7e390df217ce...",
          "command_all": "ADD file:9233f6f2237d79659a9521f7e390df217cec49f1a8aa3a12147bbca1956acdb9 /",
          "target": "/",
          "source_type": "file"
        },
        {
          "type": "CMD",
          "time": "2021-11-24T20:19:40Z",
          "is_last_instruction": true,
          "is_nop": true,
          "is_exec_form": true,
          "local_image_exists": true,
          "layer_index": 0,
          "size": 0,
          "params": "[\"/bin/sh\"]\n",
          "command_snippet": "CMD [\"/bin/sh\"]\n",
          "command_all": "CMD [\"/bin/sh\"]\n",
          "raw_tags": ["alpine:3", "alpine:3.15"]
        }
      ]
    },
    {
      "is_top_image": true,
      "id": "sha256:a4d7799749e2995d6346bc3f00cf4205d066c244bc8c7c964be1214a36a3079a",
      "full_name": "codeclimate/codeclimate-pep8:latest",
      "repo_name": "codeclimate/codeclimate-pep8",
      "version_tag": "latest",
      "raw_tags": ["codeclimate/codeclimate-pep8:latest"],
      "create_time": "2022-02-14T12:46:39Z",
      "new_size": 67817267,
      "new_size_human": "68 MB",
      "base_image_id": "sha256:c059bfaa849c4d8e4aecaeb3a10c2d9b3d85f5165c66ad3a4d937758128c4d18",
      "instructions": [
        {
          "type": "WORKDIR",
          "time": "2022-02-14T11:37:48Z",
          "is_nop": true,
          "local_image_exists": true,
          "intermediate_image_id": "sha256:fdbd59cabc69e3a0173e1aa0bf3aa552d5a56e7096f132e4add089e047e6fa00",
          "layer_index": 0,
          "size": 0,
          "params": "/usr/src/app",
          "command_snippet": "WORKDIR /usr/src/app",
          "command_all": "WORKDIR /usr/src/app",
          "system_commands": ["mkdir -p /usr/src/app"]
        },
        {
          "type": "RUN",
          "time": "2022-02-14T11:37:49Z",
          "is_nop": false,
          "local_image_exists": true,
          "intermediate_image_id": "sha256:d75a242c2aae4107693d99173b3466e329f9fbda03c1fc89f9f754ba3a58327d",
          "layer_index": 0,
          "size": 4668,
          "size_human": "4.7 kB",
          "command_snippet": "RUN adduser -u 9000 -D app",
          "command_all": "RUN adduser -u 9000 -D app",
          "system_commands": ["adduser -u 9000 -D app"]
        },
        {
          "type": "RUN",
          "time": "2022-02-14T11:38:48Z",
          "is_nop": false,
          "local_image_exists": true,
          "intermediate_image_id": "sha256:f6266f94ddd4e691c9fb3eed289255c58a15fad864a0797147575f590dc52461",
          "layer_index": 0,
          "size": 67547304,
          "size_human": "68 MB",
          "command_snippet": "RUN apk add --no-cache python3 py-pip && \\\n\t...",
          "command_all": "RUN apk add --no-cache python3 py-pip && \\\n\tpip install --upgrade pip",
          "system_commands": [
            "apk add --no-cache python3 py-pip",
            "pip install --upgrade pip"
          ]
        },
        {
          "type": "COPY",
          "time": "2022-02-14T11:38:49Z",
          "is_nop": true,
          "local_image_exists": true,
          "intermediate_image_id": "sha256:0186215a1b002830e7ce1202379ec1e8af1c15f83379222e660b8a484ef59aa3",
          "layer_index": 0,
          "size": 21,
          "size_human": "21 B",
          "params": "file:807efd865260baf2b93193b69db9174e7fd282b8701c481c413913d3f2d77422 in /usr/src/app",
          "command_snippet": "COPY file:807efd865260baf2b93193b69db9174e7f...",
          "command_all": "COPY file:807efd865260baf2b93193b69db9174e7fd282b8701c481c413913d3f2d77422 /usr/src/app",
          "target": "/usr/src/app",
          "source_type": "file"
        },
        {
          "type": "RUN",
          "time": "2022-02-14T11:38:51Z",
          "is_nop": false,
          "local_image_exists": true,
          "intermediate_image_id": "sha256:89eab0d3830e47207b54bcba8741b5565ea8d824885a9747836142f8a2da4821",
          "layer_index": 0,
          "size": 256350,
          "size_human": "256 kB",
          "command_snippet": "RUN pip install -r requirements.txt",
          "command_all": "RUN pip install -r requirements.txt",
          "system_commands": ["pip install -r requirements.txt"]
        },
        {
          "type": "COPY",
          "time": "2022-02-14T12:44:59Z",
          "is_nop": true,
          "local_image_exists": true,
          "intermediate_image_id": "sha256:5a07b1c36e9b183042de7021bd89c8c83bb7ebc9584382973ef5d70581a6fa5e",
          "layer_index": 0,
          "size": 4462,
          "size_human": "4.5 kB",
          "params": "dir:8c72c247d7db513326ad97d70982d111c27165ddb4facf617f13f796e7c6be59 in /usr/src/app",
          "command_snippet": "COPY dir:8c72c247d7db513326ad97d70982d111c27...",
          "command_all": "COPY dir:8c72c247d7db513326ad97d70982d111c27165ddb4facf617f13f796e7c6be59 /usr/src/app",
          "target": "/usr/src/app",
          "source_type": "dir"
        },
        {
          "type": "RUN",
          "time": "2022-02-14T12:44:59Z",
          "is_nop": false,
          "local_image_exists": true,
          "intermediate_image_id": "sha256:d636704522b2249a26b5b0283ff30a4072176a91bdc27fd60ad9e45177f4c414",
          "layer_index": 0,
          "size": 4462,
          "size_human": "4.5 kB",
          "command_snippet": "RUN chown -R app:app /usr/src/app",
          "command_all": "RUN chown -R app:app /usr/src/app",
          "system_commands": ["chown -R app:app /usr/src/app"]
        },
        {
          "type": "USER",
          "time": "2022-02-14T12:45:00Z",
          "is_nop": true,
          "local_image_exists": true,
          "intermediate_image_id": "sha256:f8091a62bd87685528f5a578ee2f68a55a888ead4365778f2e9ec860208f7f7d",
          "layer_index": 0,
          "size": 0,
          "params": "app",
          "command_snippet": "USER app",
          "command_all": "USER app"
        },
        {
          "type": "VOLUME",
          "time": "2022-02-14T12:45:45Z",
          "is_nop": true,
          "local_image_exists": true,
          "intermediate_image_id": "sha256:78fb896516d041de596dc22b88a8c70b30068de2458f62259d8eb6c4e8068c5c",
          "layer_index": 0,
          "size": 0,
          "params": "[/code]",
          "command_snippet": "VOLUME [/code]",
          "command_all": "VOLUME [/code]"
        },
        {
          "type": "WORKDIR",
          "time": "2022-02-14T12:45:45Z",
          "is_nop": true,
          "local_image_exists": true,
          "intermediate_image_id": "sha256:d5f2305d76b7b7decfd8c227b35884631d25ed1f8216b59a2bff6e519c7f01eb",
          "layer_index": 0,
          "size": 0,
          "params": "/code",
          "command_snippet": "WORKDIR /code",
          "command_all": "WORKDIR /code",
          "system_commands": ["mkdir -p /code"]
        },
        {
          "type": "CMD",
          "time": "2022-02-14T12:45:45Z",
          "is_nop": true,
          "is_exec_form": true,
          "local_image_exists": true,
          "intermediate_image_id": "sha256:4ceaf389c9e91cf12a51d416995423856bd1e310307ba30cd7ef8e82c648c126",
          "layer_index": 0,
          "size": 0,
          "params": "[\"/usr/src/app/codeclimate-pep8\"]\n",
          "command_snippet": "CMD [\"/usr/src/app/codeclimate-pep8\"]\n",
          "command_all": "CMD [\"/usr/src/app/codeclimate-pep8\"]\n"
        },
        {
          "type": "ARG",
          "time": "2022-02-14T12:46:36Z",
          "is_nop": true,
          "local_image_exists": true,
          "intermediate_image_id": "sha256:6fe8cc3cdc625d39593a60ea0bad03bd7952994fe54428bcb34501bb8b051244",
          "layer_index": 0,
          "size": 0,
          "params": "BUILD_DATE",
          "command_snippet": "ARG BUILD_DATE",
          "command_all": "ARG BUILD_DATE"
        },
        {
          "type": "ARG",
          "time": "2022-02-14T12:46:36Z",
          "is_nop": true,
          "local_image_exists": true,
          "intermediate_image_id": "sha256:13076a432f6591efbbd67d69ddc49b3cb6d6fe379b4f73da70c3d78bf796bf35",
          "layer_index": 0,
          "size": 0,
          "params": "REVISION",
          "command_snippet": "ARG REVISION",
          "command_all": "ARG REVISION"
        },
        {
          "type": "ARG",
          "time": "2022-02-14T12:46:37Z",
          "is_nop": true,
          "local_image_exists": true,
          "intermediate_image_id": "sha256:a63e47bcba104d042362cff2d851a7e5db63115d4b88b812f55b60ac24e73eef",
          "layer_index": 0,
          "size": 0,
          "params": "VERSION",
          "command_snippet": "ARG VERSION",
          "command_all": "ARG VERSION"
        },
        {
          "type": "LABEL",
          "time": "2022-02-14T12:46:37Z",
          "is_nop": true,
          "local_image_exists": true,
          "intermediate_image_id": "sha256:dce93145e58bcde1040946f41d54133c8d50320cb033ea4ccecff068d9c4c3bf",
          "layer_index": 0,
          "size": 0,
          "params": "maintainer=Megabyte Labs <help@megabyte.space>",
          "command_snippet": "LABEL maintainer=Megabyte Labs <help@megabyt...",
          "command_all": "LABEL maintainer=Megabyte Labs <help@megabyte.space>"
        },
        {
          "type": "LABEL",
          "time": "2022-02-14T12:46:37Z",
          "is_nop": true,
          "local_image_exists": true,
          "intermediate_image_id": "sha256:d16191ac9ce2780ed5c2fc82ead23dd1d6160a5aa5fd8794f97d51fd095ed6c0",
          "layer_index": 0,
          "size": 0,
          "params": "org.opencontainers.image.authors=Brian Zalewski <brian@megabyte.space>",
          "command_snippet": "LABEL org.opencontainers.image.authors=Brian...",
          "command_all": "LABEL org.opencontainers.image.authors=Brian Zalewski <brian@megabyte.space>"
        },
        {
          "type": "LABEL",
          "time": "2022-02-14T12:46:37Z",
          "is_nop": true,
          "local_image_exists": true,
          "intermediate_image_id": "sha256:680cc54c7f64277a0b1d1a588f9770fa5f796edba93eef1c8ffc8df9364546ab",
          "layer_index": 0,
          "size": 0,
          "params": "org.opencontainers.image.created=",
          "command_snippet": "LABEL org.opencontainers.image.created=",
          "command_all": "LABEL org.opencontainers.image.created="
        },
        {
          "type": "LABEL",
          "time": "2022-02-14T12:46:37Z",
          "is_nop": true,
          "local_image_exists": true,
          "intermediate_image_id": "sha256:5c563fb1c489bcb356bc66cbae1cc469eabc622d9dbfc65ecbe164a6433fba69",
          "layer_index": 0,
          "size": 0,
          "params": "org.opencontainers.image.description=Code Climate engine for Pep8",
          "command_snippet": "LABEL org.opencontainers.image.description=C...",
          "command_all": "LABEL org.opencontainers.image.description=Code Climate engine for Pep8"
        },
        {
          "type": "LABEL",
          "time": "2022-02-14T12:46:38Z",
          "is_nop": true,
          "local_image_exists": true,
          "intermediate_image_id": "sha256:cbb86335a7af02b795ce56eaaad4f0132b9de6ce6e577844f7c8402914b2c21e",
          "layer_index": 0,
          "size": 0,
          "params": "org.opencontainers.image.documentation=https://gitlab.com/megabyte-labs/docker/codeclimate/pep8/-/blob/master/README.md",
          "command_snippet": "LABEL org.opencontainers.image.documentation...",
          "command_all": "LABEL org.opencontainers.image.documentation=https://gitlab.com/megabyte-labs/docker/codeclimate/pep8/-/blob/master/README.md"
        },
        {
          "type": "LABEL",
          "time": "2022-02-14T12:46:38Z",
          "is_nop": true,
          "local_image_exists": true,
          "intermediate_image_id": "sha256:a2fd7168619bc82b5e0ff8cc5cdff7d280450b31a79356996a737fa0f575c3ae",
          "layer_index": 0,
          "size": 0,
          "params": "org.opencontainers.image.licenses=MIT",
          "command_snippet": "LABEL org.opencontainers.image.licenses=MIT",
          "command_all": "LABEL org.opencontainers.image.licenses=MIT"
        },
        {
          "type": "LABEL",
          "time": "2022-02-14T12:46:38Z",
          "is_nop": true,
          "local_image_exists": true,
          "intermediate_image_id": "sha256:df7e091cf2e370f893d7438b4dec0a7683710947fbc643d92f2e27032b4a0221",
          "layer_index": 0,
          "size": 0,
          "params": "org.opencontainers.image.revision=",
          "command_snippet": "LABEL org.opencontainers.image.revision=",
          "command_all": "LABEL org.opencontainers.image.revision="
        },
        {
          "type": "LABEL",
          "time": "2022-02-14T12:46:38Z",
          "is_nop": true,
          "local_image_exists": true,
          "intermediate_image_id": "sha256:a01800f9ce4d9749b03b7d7348376e86ad07423c00bbc0dbf18f4c6e2c8c9f87",
          "layer_index": 0,
          "size": 0,
          "params": "org.opencontainers.image.source=https://gitlab.com/megabyte-labs/docker/codeclimate/pep8.git",
          "command_snippet": "LABEL org.opencontainers.image.source=https:...",
          "command_all": "LABEL org.opencontainers.image.source=https://gitlab.com/megabyte-labs/docker/codeclimate/pep8.git"
        },
        {
          "type": "LABEL",
          "time": "2022-02-14T12:46:39Z",
          "is_nop": true,
          "local_image_exists": true,
          "intermediate_image_id": "sha256:2560bae291ff03043950dd422802ed75f863b516ade165ea6210154e63742f19",
          "layer_index": 0,
          "size": 0,
          "params": "org.opencontainers.image.url=https://megabyte.space",
          "command_snippet": "LABEL org.opencontainers.image.url=https://m...",
          "command_all": "LABEL org.opencontainers.image.url=https://megabyte.space"
        },
        {
          "type": "LABEL",
          "time": "2022-02-14T12:46:39Z",
          "is_nop": true,
          "local_image_exists": true,
          "intermediate_image_id": "sha256:d547795c1855e7c2d5cf89056d8bb19d4bea7f698f673f5b09cdc769ed2101c6",
          "layer_index": 0,
          "size": 0,
          "params": "org.opencontainers.image.vendor=Megabyte Labs",
          "command_snippet": "LABEL org.opencontainers.image.vendor=Megaby...",
          "command_all": "LABEL org.opencontainers.image.vendor=Megabyte Labs"
        },
        {
          "type": "LABEL",
          "time": "2022-02-14T12:46:39Z",
          "is_nop": true,
          "local_image_exists": true,
          "intermediate_image_id": "sha256:8cd0e985f0c7738a0a21a71275cf64665dc57bcf71f432e9e68ea1a6e46ee877",
          "layer_index": 0,
          "size": 0,
          "params": "org.opencontainers.image.version=",
          "command_snippet": "LABEL org.opencontainers.image.version=",
          "command_all": "LABEL org.opencontainers.image.version="
        },
        {
          "type": "LABEL",
          "time": "2022-02-14T12:46:39Z",
          "is_last_instruction": true,
          "is_nop": true,
          "local_image_exists": true,
          "layer_index": 0,
          "size": 0,
          "params": "space.megabyte.type=code-climate",
          "command_snippet": "LABEL space.megabyte.type=code-climate",
          "command_all": "LABEL space.megabyte.type=code-climate",
          "raw_tags": ["codeclimate/codeclimate-pep8:latest"]
        }
      ]
    }
  ]
}
