{
  "version": "1.0",
  "engine": "linux|Transformer|1.37.3|97eb3c8c7f8c4e295a26c13882feb3f0539ab50f|2021-12-10_09:37:29AM",
  "containerized": false,
  "host_distro": {
    "name": "Ubuntu",
    "version": "20.04",
    "display_name": "Ubuntu 20.04.3 LTS"
  },
  "type": "build",
  "state": "done",
  "target_reference": "codeclimate/codeclimate-bandit",
  "system": {
    "type": "Linux",
    "release": "5.13.0-27-generic",
    "distro": {
      "name": "Alpine Linux",
      "version": "3.15.0",
      "display_name": "Alpine Linux v3.15"
    }
  },
  "source_image": {
    "identity": {
      "id": "sha256:87c4bac4f153aa0a91a4aec6460cd220b85c6a19e179020101cc57a4271dc105",
      "tags": ["latest"],
      "names": ["codeclimate/codeclimate-bandit:latest"]
    },
    "size": 80540379,
    "size_human": "80 MB",
    "create_time": "2022-02-08T10:12:12Z",
    "docker_version": "20.10.7",
    "architecture": "amd64",
    "user": "app",
    "os": "linux",
    "volumes": ["/code"],
    "labels": {
      "maintainer": "Megabyte Labs <help@megabyte.space>",
      "org.opencontainers.image.authors": "Brian Zalewski <brian@megabyte.space>",
      "org.opencontainers.image.created": "",
      "org.opencontainers.image.description": "Code Climate engine for Bandit",
      "org.opencontainers.image.documentation": "https://gitlab.com/megabyte-labs/docker/codeclimate/bandit/-/blob/master/README.md",
      "org.opencontainers.image.licenses": "MIT",
      "org.opencontainers.image.revision": "",
      "org.opencontainers.image.source": "https://gitlab.com/megabyte-labs/docker/codeclimate/bandit.git",
      "org.opencontainers.image.url": "https://megabyte.space",
      "org.opencontainers.image.vendor": "Megabyte Labs",
      "org.opencontainers.image.version": "",
      "space.megabyte.type": "code-climate"
    },
    "env_vars": [
      "PATH=/usr/local/sbin:/usr/local/bin:/usr/sbin:/usr/bin:/sbin:/bin"
    ],
    "container_entry": {
      "exe_path": ""
    }
  },
  "minified_image_size": 15240510,
  "minified_image_size_human": "15 MB",
  "minified_image": "codeclimate/codeclimate-bandit:slim",
  "minified_image_has_data": true,
  "minified_by": 5.28462492396908,
  "artifact_location": "/tmp/docker-slim-state/.docker-slim-state/images/87c4bac4f153aa0a91a4aec6460cd220b85c6a19e179020101cc57a4271dc105/artifacts",
  "container_report_name": "creport.json",
  "seccomp_profile_name": "codeclimate-codeclimate-bandit-seccomp.json",
  "apparmor_profile_name": "codeclimate-codeclimate-bandit-apparmor-profile",
  "image_stack": [
    {
      "is_top_image": false,
      "id": "sha256:c059bfaa849c4d8e4aecaeb3a10c2d9b3d85f5165c66ad3a4d937758128c4d18",
      "full_name": "alpine:3",
      "repo_name": "alpine",
      "version_tag": "3",
      "raw_tags": ["alpine:3", "alpine:3.15"],
      "create_time": "2021-11-24T20:19:40Z",
      "new_size": 5585772,
      "new_size_human": "5.6 MB",
      "instructions": [
        {
          "type": "ADD",
          "time": "2021-11-24T20:19:40Z",
          "is_nop": true,
          "local_image_exists": false,
          "layer_index": 0,
          "size": 5585772,
          "size_human": "5.6 MB",
          "params": "file:9233f6f2237d79659a9521f7e390df217cec49f1a8aa3a12147bbca1956acdb9 in /",
          "command_snippet": "ADD file:9233f6f2237d79659a9521f7e390df217ce...",
          "command_all": "ADD file:9233f6f2237d79659a9521f7e390df217cec49f1a8aa3a12147bbca1956acdb9 /",
          "target": "/",
          "source_type": "file"
        },
        {
          "type": "CMD",
          "time": "2021-11-24T20:19:40Z",
          "is_last_instruction": true,
          "is_nop": true,
          "is_exec_form": true,
          "local_image_exists": true,
          "layer_index": 0,
          "size": 0,
          "params": "[\"/bin/sh\"]\n",
          "command_snippet": "CMD [\"/bin/sh\"]\n",
          "command_all": "CMD [\"/bin/sh\"]\n",
          "raw_tags": ["alpine:3", "alpine:3.15"]
        }
      ]
    },
    {
      "is_top_image": true,
      "id": "sha256:87c4bac4f153aa0a91a4aec6460cd220b85c6a19e179020101cc57a4271dc105",
      "full_name": "codeclimate/codeclimate-bandit:latest",
      "repo_name": "codeclimate/codeclimate-bandit",
      "version_tag": "latest",
      "raw_tags": ["codeclimate/codeclimate-bandit:latest"],
      "create_time": "2022-02-08T10:12:12Z",
      "new_size": 74954607,
      "new_size_human": "75 MB",
      "base_image_id": "sha256:c059bfaa849c4d8e4aecaeb3a10c2d9b3d85f5165c66ad3a4d937758128c4d18",
      "instructions": [
        {
          "type": "LABEL",
          "time": "2022-02-01T13:19:18Z",
          "is_nop": true,
          "local_image_exists": true,
          "intermediate_image_id": "sha256:9e76f6ffbb417f8c8cfd56e99d1060558132f3a0ce553b081c84d5d78bf94d7a",
          "layer_index": 0,
          "size": 0,
          "params": "maintainer=Benji Visser <benny@noqcks.io>",
          "command_snippet": "LABEL maintainer=Benji Visser <benny@noqcks....",
          "command_all": "LABEL maintainer=Benji Visser <benny@noqcks.io>"
        },
        {
          "type": "WORKDIR",
          "time": "2022-02-01T13:19:18Z",
          "is_nop": true,
          "local_image_exists": true,
          "intermediate_image_id": "sha256:9dff9e48f58db7ba6f384e4e1bb3ff953193c571ebae4581551d15062eec4bec",
          "layer_index": 0,
          "size": 0,
          "params": "/usr/src/app/",
          "command_snippet": "WORKDIR /usr/src/app/",
          "command_all": "WORKDIR /usr/src/app/",
          "system_commands": ["mkdir -p /usr/src/app/"]
        },
        {
          "type": "COPY",
          "time": "2022-02-01T13:19:18Z",
          "is_nop": true,
          "local_image_exists": true,
          "intermediate_image_id": "sha256:f9bb05c9929f9509b57f481b23b7a208b46e238752e4811a59605f3b6c5a6607",
          "layer_index": 0,
          "size": 14,
          "size_human": "14 B",
          "params": "file:684fb16de5563e571af03f4b8acdbbc629d13812617a99a1cbc58a7aec434088 in /usr/src/app/",
          "command_snippet": "COPY file:684fb16de5563e571af03f4b8acdbbc629...",
          "command_all": "COPY file:684fb16de5563e571af03f4b8acdbbc629d13812617a99a1cbc58a7aec434088 /usr/src/app/",
          "target": "/usr/src/app/",
          "source_type": "file"
        },
        {
          "type": "RUN",
          "time": "2022-02-01T13:35:11Z",
          "is_nop": false,
          "local_image_exists": true,
          "intermediate_image_id": "sha256:80658a306bb6918be47516668f21ee6e4edf331510a6b887c5933165331ba286",
          "layer_index": 0,
          "size": 74925123,
          "size_human": "75 MB",
          "command_snippet": "RUN apk --update add    python3 py-pip && \\\n...",
          "command_all": "RUN apk --update add    python3 py-pip && \\\n\tpip install --upgrade pip && \\\n\tpip install -r requirements.txt && \\\n\tmv /usr/bin/bandit /usr/bin/bandit3 && \\\n\trm /var/cache/apk/*",
          "system_commands": [
            "apk --update add    python3 py-pip",
            "pip install --upgrade pip",
            "pip install -r requirements.txt",
            "mv /usr/bin/bandit /usr/bin/bandit3",
            "rm /var/cache/apk/*"
          ]
        },
        {
          "type": "COPY",
          "time": "2022-02-08T10:12:07Z",
          "is_nop": true,
          "local_image_exists": true,
          "intermediate_image_id": "sha256:53235b031d2616ed0ade20d6fe1debd8dea2c32282a49855138f69dc1469b8a6",
          "layer_index": 0,
          "size": 24802,
          "size_human": "25 kB",
          "params": "dir:e70cb606f372d9b0693d5933ad5b63cf6550852203a6f55c08873c6d5e67f764 in /usr/src/app",
          "command_snippet": "COPY dir:e70cb606f372d9b0693d5933ad5b63cf655...",
          "command_all": "COPY dir:e70cb606f372d9b0693d5933ad5b63cf6550852203a6f55c08873c6d5e67f764 /usr/src/app",
          "target": "/usr/src/app",
          "source_type": "dir"
        },
        {
          "type": "RUN",
          "time": "2022-02-08T10:12:08Z",
          "is_nop": false,
          "local_image_exists": true,
          "intermediate_image_id": "sha256:e0b80f1c2cd706498c1a89b50ad0d906ec3d1b3fe808f2ae5b34685016ab2b96",
          "layer_index": 0,
          "size": 4668,
          "size_human": "4.7 kB",
          "command_snippet": "RUN adduser -u 9000 app -D",
          "command_all": "RUN adduser -u 9000 app -D",
          "system_commands": ["adduser -u 9000 app -D"]
        },
        {
          "type": "USER",
          "time": "2022-02-08T10:12:08Z",
          "is_nop": true,
          "local_image_exists": true,
          "intermediate_image_id": "sha256:60d008022c6288749ec9b02ae506c52d3729793539d57a3a32cbf0f824650527",
          "layer_index": 0,
          "size": 0,
          "params": "app",
          "command_snippet": "USER app",
          "command_all": "USER app"
        },
        {
          "type": "VOLUME",
          "time": "2022-02-08T10:12:09Z",
          "is_nop": true,
          "local_image_exists": true,
          "intermediate_image_id": "sha256:384eff0f7199d696e4b0514330f9c81bdc9be6f7348991c314bef376e1fb47de",
          "layer_index": 0,
          "size": 0,
          "params": "[/code]",
          "command_snippet": "VOLUME [/code]",
          "command_all": "VOLUME [/code]"
        },
        {
          "type": "WORKDIR",
          "time": "2022-02-08T10:12:09Z",
          "is_nop": true,
          "local_image_exists": true,
          "intermediate_image_id": "sha256:4a2862b0d77eaffd92be17b83a5b3b074599e562857affc52c409cb41007ca04",
          "layer_index": 0,
          "size": 0,
          "params": "/code",
          "command_snippet": "WORKDIR /code",
          "command_all": "WORKDIR /code",
          "system_commands": ["mkdir -p /code"]
        },
        {
          "type": "CMD",
          "time": "2022-02-08T10:12:09Z",
          "is_nop": true,
          "is_exec_form": true,
          "local_image_exists": true,
          "intermediate_image_id": "sha256:af9a04ae4d7a00719b46f4c053de710ae8a1a42156c17e1866a4773ffdc34e75",
          "layer_index": 0,
          "size": 0,
          "params": "[\"python3\",\"/usr/src/app/run.py\"]\n",
          "command_snippet": "CMD [\"python3\",\"/usr/src/app/run.py\"]\n",
          "command_all": "CMD [\"python3\",\"/usr/src/app/run.py\"]\n"
        },
        {
          "type": "ARG",
          "time": "2022-02-08T10:12:09Z",
          "is_nop": true,
          "local_image_exists": true,
          "intermediate_image_id": "sha256:acdfa8b2a3feecd257234bb9cf81b2d0923c0fed9db57193d72b3256a55babe8",
          "layer_index": 0,
          "size": 0,
          "params": "BUILD_DATE",
          "command_snippet": "ARG BUILD_DATE",
          "command_all": "ARG BUILD_DATE"
        },
        {
          "type": "ARG",
          "time": "2022-02-08T10:12:09Z",
          "is_nop": true,
          "local_image_exists": true,
          "intermediate_image_id": "sha256:45dd7f5b07a6d715f27b4876771c03140fa16c7689b5086fb7e44323389a3666",
          "layer_index": 0,
          "size": 0,
          "params": "REVISION",
          "command_snippet": "ARG REVISION",
          "command_all": "ARG REVISION"
        },
        {
          "type": "ARG",
          "time": "2022-02-08T10:12:10Z",
          "is_nop": true,
          "local_image_exists": true,
          "intermediate_image_id": "sha256:066c9070f622676dae70ecf7f9be2b2d8e7d92b41db304151cfd7b9bd7fc7635",
          "layer_index": 0,
          "size": 0,
          "params": "VERSION",
          "command_snippet": "ARG VERSION",
          "command_all": "ARG VERSION"
        },
        {
          "type": "LABEL",
          "time": "2022-02-08T10:12:10Z",
          "is_nop": true,
          "local_image_exists": true,
          "intermediate_image_id": "sha256:8d70264374d84d590c0b28ed5640569df44c0f062fd7a02763dc88f9f5218f7d",
          "layer_index": 0,
          "size": 0,
          "params": "maintainer=Megabyte Labs <help@megabyte.space>",
          "command_snippet": "LABEL maintainer=Megabyte Labs <help@megabyt...",
          "command_all": "LABEL maintainer=Megabyte Labs <help@megabyte.space>"
        },
        {
          "type": "LABEL",
          "time": "2022-02-08T10:12:10Z",
          "is_nop": true,
          "local_image_exists": true,
          "intermediate_image_id": "sha256:34be4234b7ff23a4fc0737cb09b98ec392d529d40bf62d0b8d35c57b051c6761",
          "layer_index": 0,
          "size": 0,
          "params": "org.opencontainers.image.authors=Brian Zalewski <brian@megabyte.space>",
          "command_snippet": "LABEL org.opencontainers.image.authors=Brian...",
          "command_all": "LABEL org.opencontainers.image.authors=Brian Zalewski <brian@megabyte.space>"
        },
        {
          "type": "LABEL",
          "time": "2022-02-08T10:12:10Z",
          "is_nop": true,
          "local_image_exists": true,
          "intermediate_image_id": "sha256:c3f1f1819d690966b423a9177d435063894049732c49e7dcbdce214505f34416",
          "layer_index": 0,
          "size": 0,
          "params": "org.opencontainers.image.created=",
          "command_snippet": "LABEL org.opencontainers.image.created=",
          "command_all": "LABEL org.opencontainers.image.created="
        },
        {
          "type": "LABEL",
          "time": "2022-02-08T10:12:10Z",
          "is_nop": true,
          "local_image_exists": true,
          "intermediate_image_id": "sha256:809b3859a217fd5ae99070d93013343415b426de2ec8987615a355711de33666",
          "layer_index": 0,
          "size": 0,
          "params": "org.opencontainers.image.description=Code Climate engine for Bandit",
          "command_snippet": "LABEL org.opencontainers.image.description=C...",
          "command_all": "LABEL org.opencontainers.image.description=Code Climate engine for Bandit"
        },
        {
          "type": "LABEL",
          "time": "2022-02-08T10:12:11Z",
          "is_nop": true,
          "local_image_exists": true,
          "intermediate_image_id": "sha256:f6abae49dce755791900caada7996a39a0ccdea991b1fc9f203f632cf8581e21",
          "layer_index": 0,
          "size": 0,
          "params": "org.opencontainers.image.documentation=https://gitlab.com/megabyte-labs/docker/codeclimate/bandit/-/blob/master/README.md",
          "command_snippet": "LABEL org.opencontainers.image.documentation...",
          "command_all": "LABEL org.opencontainers.image.documentation=https://gitlab.com/megabyte-labs/docker/codeclimate/bandit/-/blob/master/README.md"
        },
        {
          "type": "LABEL",
          "time": "2022-02-08T10:12:11Z",
          "is_nop": true,
          "local_image_exists": true,
          "intermediate_image_id": "sha256:4296265e3872875d2856526c43d3f32e0b7ebd01997027a18d757d4a2df8a877",
          "layer_index": 0,
          "size": 0,
          "params": "org.opencontainers.image.licenses=MIT",
          "command_snippet": "LABEL org.opencontainers.image.licenses=MIT",
          "command_all": "LABEL org.opencontainers.image.licenses=MIT"
        },
        {
          "type": "LABEL",
          "time": "2022-02-08T10:12:11Z",
          "is_nop": true,
          "local_image_exists": true,
          "intermediate_image_id": "sha256:0f2853f9403f932b1fc405039765b7cf27d5b95dbf56cb90e7d5340fdcbd9455",
          "layer_index": 0,
          "size": 0,
          "params": "org.opencontainers.image.revision=",
          "command_snippet": "LABEL org.opencontainers.image.revision=",
          "command_all": "LABEL org.opencontainers.image.revision="
        },
        {
          "type": "LABEL",
          "time": "2022-02-08T10:12:11Z",
          "is_nop": true,
          "local_image_exists": true,
          "intermediate_image_id": "sha256:971543d779f5e9c9678b807da433410aeab0fdd41ef57441fcf766c7f655f90d",
          "layer_index": 0,
          "size": 0,
          "params": "org.opencontainers.image.source=https://gitlab.com/megabyte-labs/docker/codeclimate/bandit.git",
          "command_snippet": "LABEL org.opencontainers.image.source=https:...",
          "command_all": "LABEL org.opencontainers.image.source=https://gitlab.com/megabyte-labs/docker/codeclimate/bandit.git"
        },
        {
          "type": "LABEL",
          "time": "2022-02-08T10:12:12Z",
          "is_nop": true,
          "local_image_exists": true,
          "intermediate_image_id": "sha256:deae7cab8ff758204f6c7447b37620d46e2e8820b4b3b2c09c4abdba56c593aa",
          "layer_index": 0,
          "size": 0,
          "params": "org.opencontainers.image.url=https://megabyte.space",
          "command_snippet": "LABEL org.opencontainers.image.url=https://m...",
          "command_all": "LABEL org.opencontainers.image.url=https://megabyte.space"
        },
        {
          "type": "LABEL",
          "time": "2022-02-08T10:12:12Z",
          "is_nop": true,
          "local_image_exists": true,
          "intermediate_image_id": "sha256:231c3ddcbeafb3e312f23e319ade2efcd20cacdcf59c76dffc72c5b3153e069d",
          "layer_index": 0,
          "size": 0,
          "params": "org.opencontainers.image.vendor=Megabyte Labs",
          "command_snippet": "LABEL org.opencontainers.image.vendor=Megaby...",
          "command_all": "LABEL org.opencontainers.image.vendor=Megabyte Labs"
        },
        {
          "type": "LABEL",
          "time": "2022-02-08T10:12:12Z",
          "is_nop": true,
          "local_image_exists": true,
          "intermediate_image_id": "sha256:7063469d377856f7e7d041940c986ccb2683009dca188eb676bb4c3b9b0f69af",
          "layer_index": 0,
          "size": 0,
          "params": "org.opencontainers.image.version=",
          "command_snippet": "LABEL org.opencontainers.image.version=",
          "command_all": "LABEL org.opencontainers.image.version="
        },
        {
          "type": "LABEL",
          "time": "2022-02-08T10:12:12Z",
          "is_last_instruction": true,
          "is_nop": true,
          "local_image_exists": true,
          "layer_index": 0,
          "size": 0,
          "params": "space.megabyte.type=code-climate",
          "command_snippet": "LABEL space.megabyte.type=code-climate",
          "command_all": "LABEL space.megabyte.type=code-climate",
          "raw_tags": ["codeclimate/codeclimate-bandit:latest"]
        }
      ]
    }
  ]
}
