{
  "version": "1.0",
  "engine": "darwin|Transformer|1.35.0|latest|latest",
  "containerized": false,
  "host_distro": {
    "name": "",
    "version": "",
    "display_name": "Big Sur (11.3)"
  },
  "type": "build",
  "state": "done",
  "target_reference": "megabytelabs/vagrant:latest",
  "system": {
    "type": "Linux",
    "release": "5.10.25-linuxkit",
    "distro": {
      "name": "Ubuntu",
      "version": "20.04",
      "display_name": "Ubuntu 20.04.2 LTS"
    }
  },
  "source_image": {
    "identity": {
      "id": "sha256:0fa033e58897d6e8a3b422c3a62b46323084f35693312b85053522fc843b96d3",
      "tags": ["2.2.16", "latest"],
      "names": ["megabytelabs/vagrant:2.2.16", "megabytelabs/vagrant:latest"]
    },
    "size": 245395749,
    "size_human": "245 MB",
    "create_time": "2021-06-16T02:06:59Z",
    "docker_version": "",
    "architecture": "amd64",
    "os": "linux",
    "labels": {
      "maintainer": "Megabyte Labs <help@megabyte.space",
      "org.opencontainers.image.authors": "Brian Zalewski <brian@megabyte.space>",
      "org.opencontainers.image.created": "2021-06-16T03:33:44-04:00",
      "org.opencontainers.image.description": "A compact Vagrant container that you can use in CI environments as well as from the command-line as a one-liner (only 11.0866 MB compressed!)",
      "org.opencontainers.image.documentation": "https://gitlab.com/megabyte-labs/dockerfile/ci-pipeline/vagrant/-/blob/master/README.md",
      "org.opencontainers.image.licenses": "MIT",
      "org.opencontainers.image.revision": "69758b904a5a6ed7d1634a80143af6e0b7ddc65a",
      "org.opencontainers.image.source": "https://gitlab.com/megabyte-labs/dockerfile/ci-pipeline/vagrant.git",
      "org.opencontainers.image.url": "https://megabyte.space",
      "org.opencontainers.image.vendor": "Megabyte Labs",
      "org.opencontainers.image.version": "2.2.16",
      "space.megabyte.type": "ci-pipeline"
    },
    "env_vars": [
      "PATH=/usr/local/sbin:/usr/local/bin:/usr/sbin:/usr/bin:/sbin:/bin",
      "container=docker",
      "VAGRANT_RELEASE_URL=https://releases.hashicorp.com/vagrant/"
    ]
  },
  "minified_image_size": 27512944,
  "minified_image_size_human": "28 MB",
  "minified_image": "megabytelabs/vagrant:slim",
  "minified_image_has_data": true,
  "minified_by": 8.919283556132706,
  "artifact_location": "/tmp/docker-slim-state/.docker-slim-state/images/0fa033e58897d6e8a3b422c3a62b46323084f35693312b85053522fc843b96d3/artifacts",
  "container_report_name": "creport.json",
  "seccomp_profile_name": "megabytelabs-vagrant-seccomp.json",
  "apparmor_profile_name": "megabytelabs-vagrant-apparmor-profile",
  "image_stack": [
    {
      "is_top_image": true,
      "id": "sha256:0fa033e58897d6e8a3b422c3a62b46323084f35693312b85053522fc843b96d3",
      "full_name": "megabytelabs/vagrant:2.2.16",
      "repo_name": "megabytelabs/vagrant",
      "version_tag": "2.2.16",
      "raw_tags": ["megabytelabs/vagrant:2.2.16", "megabytelabs/vagrant:latest"],
      "create_time": "2021-06-16T02:06:59Z",
      "new_size": 245395749,
      "new_size_human": "245 MB",
      "instructions": [
        {
          "type": "ADD",
          "time": "2021-04-23T22:21:34Z",
          "is_nop": true,
          "local_image_exists": false,
          "layer_index": 0,
          "size": 72703898,
          "size_human": "73 MB",
          "params": "file:5c44a80f547b7d68b550b0e64aef898b361666857abf9a5c8f3f8d0567b8e8e4 in /",
          "command_snippet": "ADD file:5c44a80f547b7d68b550b0e64aef898b361...",
          "command_all": "ADD file:5c44a80f547b7d68b550b0e64aef898b361666857abf9a5c8f3f8d0567b8e8e4 /",
          "target": "/",
          "source_type": "file"
        },
        {
          "type": "RUN",
          "time": "2021-04-23T22:21:35Z",
          "is_nop": false,
          "local_image_exists": false,
          "layer_index": 0,
          "size": 811,
          "size_human": "811 B",
          "command_snippet": "RUN set -xe && \\\n\techo '#!/bin/sh' > /usr/sb...",
          "command_all": "RUN set -xe && \\\n\techo '#!/bin/sh' > /usr/sbin/policy-rc.d && \\\n\techo 'exit 101' >> /usr/sbin/policy-rc.d && \\\n\tchmod +x /usr/sbin/policy-rc.d && \\\n\tdpkg-divert --local --rename --add /sbin/initctl && \\\n\tcp -a /usr/sbin/policy-rc.d /sbin/initctl && \\\n\tsed -i 's/^exit.*/exit 0/' /sbin/initctl && \\\n\techo 'force-unsafe-io' > /etc/dpkg/dpkg.cfg.d/docker-apt-speedup && \\\n\techo 'DPkg::Post-Invoke { \"rm -f /var/cache/apt/archives/*.deb /var/cache/apt/archives/partial/*.deb /var/cache/apt/*.bin || true\"; };' > /etc/apt/apt.conf.d/docker-clean && \\\n\techo 'APT::Update::Post-Invoke { \"rm -f /var/cache/apt/archives/*.deb /var/cache/apt/archives/partial/*.deb /var/cache/apt/*.bin || true\"; };' >> /etc/apt/apt.conf.d/docker-clean && \\\n\techo 'Dir::Cache::pkgcache \"\"; Dir::Cache::srcpkgcache \"\";' >> /etc/apt/apt.conf.d/docker-clean && \\\n\techo 'Acquire::Languages \"none\";' > /etc/apt/apt.conf.d/docker-no-languages && \\\n\techo 'Acquire::GzipIndexes \"true\"; Acquire::CompressionTypes::Order:: \"gz\";' > /etc/apt/apt.conf.d/docker-gzip-indexes && \\\n\techo 'Apt::AutoRemove::SuggestsImportant \"false\";' > /etc/apt/apt.conf.d/docker-autoremove-suggests",
          "system_commands": [
            "set -xe",
            "echo '#!/bin/sh' > /usr/sbin/policy-rc.d",
            "echo 'exit 101' >> /usr/sbin/policy-rc.d",
            "chmod +x /usr/sbin/policy-rc.d",
            "dpkg-divert --local --rename --add /sbin/initctl",
            "cp -a /usr/sbin/policy-rc.d /sbin/initctl",
            "sed -i 's/^exit.*/exit 0/' /sbin/initctl",
            "echo 'force-unsafe-io' > /etc/dpkg/dpkg.cfg.d/docker-apt-speedup",
            "echo 'DPkg::Post-Invoke { \"rm -f /var/cache/apt/archives/*.deb /var/cache/apt/archives/partial/*.deb /var/cache/apt/*.bin || true\"; };' > /etc/apt/apt.conf.d/docker-clean",
            "echo 'APT::Update::Post-Invoke { \"rm -f /var/cache/apt/archives/*.deb /var/cache/apt/archives/partial/*.deb /var/cache/apt/*.bin || true\"; };' >> /etc/apt/apt.conf.d/docker-clean",
            "echo 'Dir::Cache::pkgcache \"\"; Dir::Cache::srcpkgcache \"\";' >> /etc/apt/apt.conf.d/docker-clean",
            "echo 'Acquire::Languages \"none\";' > /etc/apt/apt.conf.d/docker-no-languages",
            "echo 'Acquire::GzipIndexes \"true\"; Acquire::CompressionTypes::Order:: \"gz\";' > /etc/apt/apt.conf.d/docker-gzip-indexes",
            "echo 'Apt::AutoRemove::SuggestsImportant \"false\";' > /etc/apt/apt.conf.d/docker-autoremove-suggests"
          ]
        },
        {
          "type": "RUN",
          "time": "2021-04-23T22:21:36Z",
          "is_nop": false,
          "local_image_exists": false,
          "layer_index": 0,
          "size": 0,
          "command_snippet": "RUN [ -z \"$(apt-get indextargets)\" ]",
          "command_all": "RUN [ -z \"$(apt-get indextargets)\" ]",
          "system_commands": ["[ -z \"$(apt-get indextargets)\" ]"]
        },
        {
          "type": "RUN",
          "time": "2021-04-23T22:21:37Z",
          "is_nop": false,
          "local_image_exists": false,
          "layer_index": 0,
          "size": 7,
          "size_human": "7 B",
          "command_snippet": "RUN mkdir -p /run/systemd && \\\n\techo 'docker...",
          "command_all": "RUN mkdir -p /run/systemd && \\\n\techo 'docker' > /run/systemd/container",
          "system_commands": ["mkdir -p /run/systemd", "echo 'docker' > /run/systemd/container"]
        },
        {
          "type": "CMD",
          "time": "2021-04-23T22:21:37Z",
          "is_nop": true,
          "is_exec_form": true,
          "local_image_exists": false,
          "layer_index": 0,
          "size": 0,
          "params": "[\"/bin/bash\"]",
          "command_snippet": "CMD [\"/bin/bash\"]",
          "command_all": "CMD [\"/bin/bash\"]"
        },
        {
          "type": "RUN",
          "time": "2021-06-16T02:06:59Z",
          "is_nop": false,
          "is_exec_form": true,
          "local_image_exists": false,
          "layer_index": 0,
          "size": 0,
          "command_snippet": "RUN [\"ENV\",\"container=docker\"]",
          "command_all": "RUN [\"ENV\",\"container=docker\"]",
          "system_commands": ["[\"ENV\",\"container=docker\"]"],
          "comment": "buildkit.dockerfile.v0"
        },
        {
          "type": "RUN",
          "time": "2021-06-16T02:06:59Z",
          "is_nop": false,
          "is_exec_form": true,
          "local_image_exists": false,
          "layer_index": 0,
          "size": 0,
          "command_snippet": "RUN [\"ENV\",\"VAGRANT_RELEASE_URL=https://rele...",
          "command_all": "RUN [\"ENV\",\"VAGRANT_RELEASE_URL=https://releases.hashicorp.com/vagrant/\"]",
          "system_commands": ["[\"ENV\",\"VAGRANT_RELEASE_URL=https://releases.hashicorp.com/vagrant/\"]"],
          "comment": "buildkit.dockerfile.v0"
        },
        {
          "type": "RUN",
          "time": "2021-06-16T02:06:59Z",
          "is_nop": false,
          "is_exec_form": true,
          "local_image_exists": false,
          "layer_index": 0,
          "size": 0,
          "command_snippet": "RUN [\"SHELL\",\"[/bin/bash\",\"-eo\",\"pipefail\",\"...",
          "command_all": "RUN [\"SHELL\",\"[/bin/bash\",\"-eo\",\"pipefail\",\"-c]\"]",
          "system_commands": ["[\"SHELL\",\"[/bin/bash\",\"-eo\",\"pipefail\",\"-c]\"]"],
          "comment": "buildkit.dockerfile.v0"
        },
        {
          "type": "RUN",
          "time": "2021-06-16T02:06:59Z",
          "is_nop": false,
          "is_exec_form": true,
          "local_image_exists": false,
          "layer_index": 0,
          "size": 172691033,
          "size_human": "173 MB",
          "command_snippet": "RUN [\"RUN\",\"/bin/bash\",\"-eo\",\"pipefail\",\"-c\"...",
          "command_all": "RUN [\"RUN\",\"/bin/bash\",\"-eo\",\"pipefail\",\"-c\",\"apt-get\",\"update\",\"-y\",\"\\u0026\\u0026\",\"apt-get\",\"install\",\"--no-install-recommends\",\"-y\",\"ca-certificates=*\",\"curl=7.*\",\"\\u0026\\u0026\",\"URL_REGEX=((([[:digit:]]+.)+)[[:digit:]]+)\",\"\\u0026\\u0026\",\"DEB_REGEX=[[:print:]]+64.deb\",\"\\u0026\\u0026\",\"DEST_DIR=/tmp\",\"\\u0026\\u0026\",\"FILE_NAME=vagrant.deb\",\"\\u0026\\u0026\",\"RELEASES=$(curl\",\"$VAGRANT_RELEASE_URL)\",\"\\u0026\\u0026\",\"[[\",\"$RELEASES\",\"=~\",\"$URL_REGEX\",\"]]\",\"\\u0026\\u0026\",\"LATEST_VERSION=${BASH_REMATCH[0]}\",\"\\u0026\\u0026\",\"CHECKSUMS=$(curl\",\"${VAGRANT_RELEASE_URL%/}/${LATEST_VERSION}/vagrant_${LATEST_VERSION}_SHA256SUMS)\",\"\\u0026\\u0026\",\"[[\",\"$CHECKSUMS\",\"=~\",\"$DEB_REGEX\",\"]]\",\"\\u0026\\u0026\",\"CHECKSUM_DEB=${BASH_REMATCH[0]}\",\"\\u0026\\u0026\",\"CHECKSUM=${CHECKSUM_DEB%  vagrant_${LATEST_VERSION}_x86_64.deb}\",\"\\u0026\\u0026\",\"curl\",\"${VAGRANT_RELEASE_URL%/}/${LATEST_VERSION}/vagrant_${LATEST_VERSION}_x86_64.deb\",\"-o\",\"${DEST_DIR}/${FILE_NAME}\",\"\\u0026\\u0026\",\"echo\",\"${CHECKSUM} ${DEST_DIR}/${FILE_NAME}\",\"|\",\"sha256sum\",\"-c\",\"\\u0026\\u0026\",\"apt-get\",\"install\",\"--no-install-recommends\",\"-y\",\"${DEST_DIR}/${FILE_NAME}\",\"\\u0026\\u0026\",\"apt-get\",\"clean\",\"\\u0026\\u0026\",\"rm\",\"-rf\",\"/var/lib/apt/lists/*\"]",
          "system_commands": [
            "[\"RUN\",\"/bin/bash\",\"-eo\",\"pipefail\",\"-c\",\"apt-get\",\"update\",\"-y\",\"u0026u0026\",\"apt-get\",\"install\",\"--no-install-recommends\",\"-y\",\"ca-certificates=*\",\"curl=7.*\",\"u0026u0026\",\"URL_REGEX=((([[:digit:]]+.)+)[[:digit:]]+)\",\"u0026u0026\",\"DEB_REGEX=[[:print:]]+64.deb\",\"u0026u0026\",\"DEST_DIR=/tmp\",\"u0026u0026\",\"FILE_NAME=vagrant.deb\",\"u0026u0026\",\"RELEASES=$(curl\",\"$VAGRANT_RELEASE_URL)\",\"u0026u0026\",\"[[\",\"$RELEASES\",\"=~\",\"$URL_REGEX\",\"]]\",\"u0026u0026\",\"LATEST_VERSION=${BASH_REMATCH[0]}\",\"u0026u0026\",\"CHECKSUMS=$(curl\",\"${VAGRANT_RELEASE_URL%/}/${LATEST_VERSION}/vagrant_${LATEST_VERSION}_SHA256SUMS)\",\"u0026u0026\",\"[[\",\"$CHECKSUMS\",\"=~\",\"$DEB_REGEX\",\"]]\",\"u0026u0026\",\"CHECKSUM_DEB=${BASH_REMATCH[0]}\",\"u0026u0026\",\"CHECKSUM=${CHECKSUM_DEB%  vagrant_${LATEST_VERSION}_x86_64.deb}\",\"u0026u0026\",\"curl\",\"${VAGRANT_RELEASE_URL%/}/${LATEST_VERSION}/vagrant_${LATEST_VERSION}_x86_64.deb\",\"-o\",\"${DEST_DIR}/${FILE_NAME}\",\"u0026u0026\",\"echo\",\"${CHECKSUM} ${DEST_DIR}/${FILE_NAME}\",\"|\",\"sha256sum\",\"-c\",\"u0026u0026\",\"apt-get\",\"install\",\"--no-install-recommends\",\"-y\",\"${DEST_DIR}/${FILE_NAME}\",\"u0026u0026\",\"apt-get\",\"clean\",\"u0026u0026\",\"rm\",\"-rf\",\"/var/lib/apt/lists/*\"]"
          ],
          "comment": "buildkit.dockerfile.v0"
        },
        {
          "type": "RUN",
          "time": "2021-06-16T02:06:59Z",
          "is_nop": false,
          "is_exec_form": true,
          "local_image_exists": false,
          "layer_index": 0,
          "size": 0,
          "command_snippet": "RUN [\"WORKDIR\",\"/work\"]",
          "command_all": "RUN [\"WORKDIR\",\"/work\"]",
          "system_commands": ["[\"WORKDIR\",\"/work\"]"],
          "comment": "buildkit.dockerfile.v0"
        },
        {
          "type": "RUN",
          "time": "2021-06-16T02:06:59Z",
          "is_nop": false,
          "is_exec_form": true,
          "local_image_exists": false,
          "layer_index": 0,
          "size": 0,
          "command_snippet": "RUN [\"ENTRYPOINT\",\"[vagrant]\"]",
          "command_all": "RUN [\"ENTRYPOINT\",\"[vagrant]\"]",
          "system_commands": ["[\"ENTRYPOINT\",\"[vagrant]\"]"],
          "comment": "buildkit.dockerfile.v0"
        },
        {
          "type": "RUN",
          "time": "2021-06-16T02:06:59Z",
          "is_nop": false,
          "is_exec_form": true,
          "local_image_exists": false,
          "layer_index": 0,
          "size": 0,
          "command_snippet": "RUN [\"CMD\",\"[--version]\"]",
          "command_all": "RUN [\"CMD\",\"[--version]\"]",
          "system_commands": ["[\"CMD\",\"[--version]\"]"],
          "comment": "buildkit.dockerfile.v0"
        },
        {
          "type": "RUN",
          "time": "2021-06-16T02:06:59Z",
          "is_nop": false,
          "is_exec_form": true,
          "local_image_exists": false,
          "layer_index": 0,
          "size": 0,
          "command_snippet": "RUN [\"ARG\",\"BUILD_DATE\"]",
          "command_all": "RUN [\"ARG\",\"BUILD_DATE\"]",
          "system_commands": ["[\"ARG\",\"BUILD_DATE\"]"],
          "comment": "buildkit.dockerfile.v0"
        },
        {
          "type": "RUN",
          "time": "2021-06-16T02:06:59Z",
          "is_nop": false,
          "is_exec_form": true,
          "local_image_exists": false,
          "layer_index": 0,
          "size": 0,
          "command_snippet": "RUN [\"ARG\",\"REVISION\"]",
          "command_all": "RUN [\"ARG\",\"REVISION\"]",
          "system_commands": ["[\"ARG\",\"REVISION\"]"],
          "comment": "buildkit.dockerfile.v0"
        },
        {
          "type": "RUN",
          "time": "2021-06-16T02:06:59Z",
          "is_nop": false,
          "is_exec_form": true,
          "local_image_exists": false,
          "layer_index": 0,
          "size": 0,
          "command_snippet": "RUN [\"ARG\",\"VERSION\"]",
          "command_all": "RUN [\"ARG\",\"VERSION\"]",
          "system_commands": ["[\"ARG\",\"VERSION\"]"],
          "comment": "buildkit.dockerfile.v0"
        },
        {
          "type": "RUN",
          "time": "2021-06-16T02:06:59Z",
          "is_nop": false,
          "is_exec_form": true,
          "local_image_exists": false,
          "layer_index": 0,
          "size": 0,
          "command_snippet": "RUN [\"LABEL\",\"maintainer=Megabyte\",\"Labs\",\"\\...",
          "command_all": "RUN [\"LABEL\",\"maintainer=Megabyte\",\"Labs\",\"\\u003chelp@megabyte.space\"]",
          "system_commands": ["[\"LABEL\",\"maintainer=Megabyte\",\"Labs\",\"u003chelp@megabyte.space\"]"],
          "comment": "buildkit.dockerfile.v0"
        },
        {
          "type": "RUN",
          "time": "2021-06-16T02:06:59Z",
          "is_nop": false,
          "is_exec_form": true,
          "local_image_exists": false,
          "layer_index": 0,
          "size": 0,
          "command_snippet": "RUN [\"LABEL\",\"org.opencontainers.image.autho...",
          "command_all": "RUN [\"LABEL\",\"org.opencontainers.image.authors=Brian\",\"Zalewski\",\"\\u003cbrian@megabyte.space\\u003e\"]",
          "system_commands": [
            "[\"LABEL\",\"org.opencontainers.image.authors=Brian\",\"Zalewski\",\"u003cbrian@megabyte.spaceu003e\"]"
          ],
          "comment": "buildkit.dockerfile.v0"
        },
        {
          "type": "RUN",
          "time": "2021-06-16T02:06:59Z",
          "is_nop": false,
          "is_exec_form": true,
          "local_image_exists": false,
          "layer_index": 0,
          "size": 0,
          "command_snippet": "RUN [\"LABEL\",\"org.opencontainers.image.creat...",
          "command_all": "RUN [\"LABEL\",\"org.opencontainers.image.created=2021-06-16T03:33:44-04:00\"]",
          "system_commands": ["[\"LABEL\",\"org.opencontainers.image.created=2021-06-16T03:33:44-04:00\"]"],
          "comment": "buildkit.dockerfile.v0"
        },
        {
          "type": "RUN",
          "time": "2021-06-16T02:06:59Z",
          "is_nop": false,
          "is_exec_form": true,
          "local_image_exists": false,
          "layer_index": 0,
          "size": 0,
          "command_snippet": "RUN [\"LABEL\",\"org.opencontainers.image.descr...",
          "command_all": "RUN [\"LABEL\",\"org.opencontainers.image.description=A\",\"compact\",\"Vagrant\",\"container\",\"that\",\"you\",\"can\",\"use\",\"in\",\"CI\",\"environments\",\"as\",\"well\",\"as\",\"from\",\"the\",\"command-line\",\"as\",\"a\",\"one-liner\",\"(only\",\"11.0866\",\"MB\",\"compressed!)\"]",
          "system_commands": [
            "[\"LABEL\",\"org.opencontainers.image.description=A\",\"compact\",\"Vagrant\",\"container\",\"that\",\"you\",\"can\",\"use\",\"in\",\"CI\",\"environments\",\"as\",\"well\",\"as\",\"from\",\"the\",\"command-line\",\"as\",\"a\",\"one-liner\",\"(only\",\"11.0866\",\"MB\",\"compressed!)\"]"
          ],
          "comment": "buildkit.dockerfile.v0"
        },
        {
          "type": "RUN",
          "time": "2021-06-16T02:06:59Z",
          "is_nop": false,
          "is_exec_form": true,
          "local_image_exists": false,
          "layer_index": 0,
          "size": 0,
          "command_snippet": "RUN [\"LABEL\",\"org.opencontainers.image.docum...",
          "command_all": "RUN [\"LABEL\",\"org.opencontainers.image.documentation=https://gitlab.com/megabyte-labs/dockerfile/ci-pipeline/vagrant/-/blob/master/README.md\"]",
          "system_commands": [
            "[\"LABEL\",\"org.opencontainers.image.documentation=https://gitlab.com/megabyte-labs/dockerfile/ci-pipeline/vagrant/-/blob/master/README.md\"]"
          ],
          "comment": "buildkit.dockerfile.v0"
        },
        {
          "type": "RUN",
          "time": "2021-06-16T02:06:59Z",
          "is_nop": false,
          "is_exec_form": true,
          "local_image_exists": false,
          "layer_index": 0,
          "size": 0,
          "command_snippet": "RUN [\"LABEL\",\"org.opencontainers.image.licen...",
          "command_all": "RUN [\"LABEL\",\"org.opencontainers.image.licenses=MIT\"]",
          "system_commands": ["[\"LABEL\",\"org.opencontainers.image.licenses=MIT\"]"],
          "comment": "buildkit.dockerfile.v0"
        },
        {
          "type": "RUN",
          "time": "2021-06-16T02:06:59Z",
          "is_nop": false,
          "is_exec_form": true,
          "local_image_exists": false,
          "layer_index": 0,
          "size": 0,
          "command_snippet": "RUN [\"LABEL\",\"org.opencontainers.image.revis...",
          "command_all": "RUN [\"LABEL\",\"org.opencontainers.image.revision=69758b904a5a6ed7d1634a80143af6e0b7ddc65a\"]",
          "system_commands": [
            "[\"LABEL\",\"org.opencontainers.image.revision=69758b904a5a6ed7d1634a80143af6e0b7ddc65a\"]"
          ],
          "comment": "buildkit.dockerfile.v0"
        },
        {
          "type": "RUN",
          "time": "2021-06-16T02:06:59Z",
          "is_nop": false,
          "is_exec_form": true,
          "local_image_exists": false,
          "layer_index": 0,
          "size": 0,
          "command_snippet": "RUN [\"LABEL\",\"org.opencontainers.image.sourc...",
          "command_all": "RUN [\"LABEL\",\"org.opencontainers.image.source=https://gitlab.com/megabyte-labs/dockerfile/ci-pipeline/vagrant.git\"]",
          "system_commands": [
            "[\"LABEL\",\"org.opencontainers.image.source=https://gitlab.com/megabyte-labs/dockerfile/ci-pipeline/vagrant.git\"]"
          ],
          "comment": "buildkit.dockerfile.v0"
        },
        {
          "type": "RUN",
          "time": "2021-06-16T02:06:59Z",
          "is_nop": false,
          "is_exec_form": true,
          "local_image_exists": false,
          "layer_index": 0,
          "size": 0,
          "command_snippet": "RUN [\"LABEL\",\"org.opencontainers.image.url=h...",
          "command_all": "RUN [\"LABEL\",\"org.opencontainers.image.url=https://megabyte.space\"]",
          "system_commands": ["[\"LABEL\",\"org.opencontainers.image.url=https://megabyte.space\"]"],
          "comment": "buildkit.dockerfile.v0"
        },
        {
          "type": "RUN",
          "time": "2021-06-16T02:06:59Z",
          "is_nop": false,
          "is_exec_form": true,
          "local_image_exists": false,
          "layer_index": 0,
          "size": 0,
          "command_snippet": "RUN [\"LABEL\",\"org.opencontainers.image.vendo...",
          "command_all": "RUN [\"LABEL\",\"org.opencontainers.image.vendor=Megabyte\",\"Labs\"]",
          "system_commands": ["[\"LABEL\",\"org.opencontainers.image.vendor=Megabyte\",\"Labs\"]"],
          "comment": "buildkit.dockerfile.v0"
        },
        {
          "type": "RUN",
          "time": "2021-06-16T02:06:59Z",
          "is_nop": false,
          "is_exec_form": true,
          "local_image_exists": false,
          "layer_index": 0,
          "size": 0,
          "command_snippet": "RUN [\"LABEL\",\"org.opencontainers.image.versi...",
          "command_all": "RUN [\"LABEL\",\"org.opencontainers.image.version=2.2.16\"]",
          "system_commands": ["[\"LABEL\",\"org.opencontainers.image.version=2.2.16\"]"],
          "comment": "buildkit.dockerfile.v0"
        },
        {
          "type": "RUN",
          "time": "2021-06-16T02:06:59Z",
          "is_last_instruction": true,
          "is_nop": false,
          "is_exec_form": true,
          "local_image_exists": true,
          "layer_index": 0,
          "size": 0,
          "command_snippet": "RUN [\"LABEL\",\"space.megabyte.type=ci-pipelin...",
          "command_all": "RUN [\"LABEL\",\"space.megabyte.type=ci-pipeline\"]",
          "system_commands": ["[\"LABEL\",\"space.megabyte.type=ci-pipeline\"]"],
          "comment": "buildkit.dockerfile.v0",
          "raw_tags": ["megabytelabs/vagrant:2.2.16", "megabytelabs/vagrant:latest"]
        }
      ]
    }
  ]
}
