{
  "version": "1.0",
  "engine": "darwin|Transformer|1.35.0|latest|latest",
  "containerized": false,
  "host_distro": {
    "name": "",
    "version": "",
    "display_name": "Big Sur (11.3)"
  },
  "type": "build",
  "state": "done",
  "target_reference": "megabytelabs/propagate:latest",
  "system": {
    "type": "Linux",
    "release": "5.10.25-linuxkit",
    "distro": {
      "name": "Alpine Linux",
      "version": "3.14.0",
      "display_name": "Alpine Linux v3.14"
    }
  },
  "source_image": {
    "identity": {
      "id": "sha256:bccd39d46d09403fad65cba5b6d41b8a4727bc16e9b96c92361f0f16f804f313",
      "tags": ["0.0.8", "latest"],
      "names": ["megabytelabs/propagate:0.0.8", "megabytelabs/propagate:latest"]
    },
    "size": 10940477,
    "size_human": "11 MB",
    "create_time": "2021-06-16T07:18:32Z",
    "docker_version": "",
    "architecture": "amd64",
    "os": "linux",
    "labels": {
      "maintainer": "Megabyte Labs <help@megabyte.space",
      "org.opencontainers.image.authors": "Brian Zalewski <brian@megabyte.space>",
      "org.opencontainers.image.created": "2021-06-16T03:19:51-04:00",
      "org.opencontainers.image.description": "A tiny container that only includes bash, curl, and jq intended for use in CI environments (only 3.89211 MB compressed!)",
      "org.opencontainers.image.documentation": "https://gitlab.com/megabyte-labs/dockerfile/ci-pipeline/propagate/-/blob/master/README.md",
      "org.opencontainers.image.licenses": "MIT",
      "org.opencontainers.image.revision": "9c5e3e563ff19076e30794ef58cb96c05d449ae9",
      "org.opencontainers.image.source": "https://gitlab.com/megabyte-labs/dockerfile/ci-pipeline/propagate.git",
      "org.opencontainers.image.url": "https://megabyte.space",
      "org.opencontainers.image.vendor": "Megabyte Labs",
      "org.opencontainers.image.version": "0.0.8",
      "space.megabyte.type": "ci-pipeline"
    },
    "env_vars": ["PATH=/usr/local/sbin:/usr/local/bin:/usr/sbin:/usr/bin:/sbin:/bin", "container=docker"]
  },
  "minified_image_size": 8235718,
  "minified_image_size_human": "8.2 MB",
  "minified_image": "megabytelabs/propagate:slim",
  "minified_image_has_data": true,
  "minified_by": 1.3284181172789062,
  "artifact_location": "/tmp/docker-slim-state/.docker-slim-state/images/bccd39d46d09403fad65cba5b6d41b8a4727bc16e9b96c92361f0f16f804f313/artifacts",
  "container_report_name": "creport.json",
  "seccomp_profile_name": "megabytelabs-propagate-seccomp.json",
  "apparmor_profile_name": "megabytelabs-propagate-apparmor-profile",
  "image_stack": [
    {
      "is_top_image": true,
      "id": "sha256:bccd39d46d09403fad65cba5b6d41b8a4727bc16e9b96c92361f0f16f804f313",
      "full_name": "megabytelabs/propagate:0.0.8",
      "repo_name": "megabytelabs/propagate",
      "version_tag": "0.0.8",
      "raw_tags": ["megabytelabs/propagate:0.0.8", "megabytelabs/propagate:latest"],
      "create_time": "2021-06-16T07:18:32Z",
      "new_size": 10940477,
      "new_size_human": "11 MB",
      "instructions": [
        {
          "type": "ADD",
          "time": "2021-06-15T22:19:37Z",
          "is_nop": true,
          "local_image_exists": false,
          "layer_index": 0,
          "size": 5595013,
          "size_human": "5.6 MB",
          "params": "file:f278386b0cef68136129f5f58c52445590a417b624d62bca158d4dc926c340df in /",
          "command_snippet": "ADD file:f278386b0cef68136129f5f58c52445590a...",
          "command_all": "ADD file:f278386b0cef68136129f5f58c52445590a417b624d62bca158d4dc926c340df /",
          "target": "/",
          "source_type": "file"
        },
        {
          "type": "CMD",
          "time": "2021-06-15T22:19:37Z",
          "is_nop": true,
          "is_exec_form": true,
          "local_image_exists": false,
          "layer_index": 0,
          "size": 0,
          "params": "[\"/bin/sh\"]",
          "command_snippet": "CMD [\"/bin/sh\"]",
          "command_all": "CMD [\"/bin/sh\"]"
        },
        {
          "type": "RUN",
          "time": "2021-06-16T07:18:32Z",
          "is_nop": false,
          "is_exec_form": true,
          "local_image_exists": false,
          "layer_index": 0,
          "size": 0,
          "command_snippet": "RUN [\"ENV\",\"container=docker\"]",
          "command_all": "RUN [\"ENV\",\"container=docker\"]",
          "system_commands": ["[\"ENV\",\"container=docker\"]"],
          "comment": "buildkit.dockerfile.v0"
        },
        {
          "type": "RUN",
          "time": "2021-06-16T07:18:32Z",
          "is_nop": false,
          "is_exec_form": true,
          "local_image_exists": false,
          "layer_index": 0,
          "size": 5345464,
          "size_human": "5.3 MB",
          "command_snippet": "RUN [\"RUN\",\"/bin/sh\",\"-c\",\"apk\",\"--no-cache\"...",
          "command_all": "RUN [\"RUN\",\"/bin/sh\",\"-c\",\"apk\",\"--no-cache\",\"add\",\"bash~=5\",\"ca-certificates~=20191127\",\"curl~=7\",\"jq~=1\"]",
          "system_commands": [
            "[\"RUN\",\"/bin/sh\",\"-c\",\"apk\",\"--no-cache\",\"add\",\"bash~=5\",\"ca-certificates~=20191127\",\"curl~=7\",\"jq~=1\"]"
          ],
          "comment": "buildkit.dockerfile.v0"
        },
        {
          "type": "RUN",
          "time": "2021-06-16T07:18:32Z",
          "is_nop": false,
          "is_exec_form": true,
          "local_image_exists": false,
          "layer_index": 0,
          "size": 0,
          "command_snippet": "RUN [\"WORKDIR\",\"/work\"]",
          "command_all": "RUN [\"WORKDIR\",\"/work\"]",
          "system_commands": ["[\"WORKDIR\",\"/work\"]"],
          "comment": "buildkit.dockerfile.v0"
        },
        {
          "type": "RUN",
          "time": "2021-06-16T07:18:32Z",
          "is_nop": false,
          "is_exec_form": true,
          "local_image_exists": false,
          "layer_index": 0,
          "size": 0,
          "command_snippet": "RUN [\"ARG\",\"BUILD_DATE\"]",
          "command_all": "RUN [\"ARG\",\"BUILD_DATE\"]",
          "system_commands": ["[\"ARG\",\"BUILD_DATE\"]"],
          "comment": "buildkit.dockerfile.v0"
        },
        {
          "type": "RUN",
          "time": "2021-06-16T07:18:32Z",
          "is_nop": false,
          "is_exec_form": true,
          "local_image_exists": false,
          "layer_index": 0,
          "size": 0,
          "command_snippet": "RUN [\"ARG\",\"REVISION\"]",
          "command_all": "RUN [\"ARG\",\"REVISION\"]",
          "system_commands": ["[\"ARG\",\"REVISION\"]"],
          "comment": "buildkit.dockerfile.v0"
        },
        {
          "type": "RUN",
          "time": "2021-06-16T07:18:32Z",
          "is_nop": false,
          "is_exec_form": true,
          "local_image_exists": false,
          "layer_index": 0,
          "size": 0,
          "command_snippet": "RUN [\"ARG\",\"VERSION\"]",
          "command_all": "RUN [\"ARG\",\"VERSION\"]",
          "system_commands": ["[\"ARG\",\"VERSION\"]"],
          "comment": "buildkit.dockerfile.v0"
        },
        {
          "type": "RUN",
          "time": "2021-06-16T07:18:32Z",
          "is_nop": false,
          "is_exec_form": true,
          "local_image_exists": false,
          "layer_index": 0,
          "size": 0,
          "command_snippet": "RUN [\"LABEL\",\"maintainer=Megabyte\",\"Labs\",\"\\...",
          "command_all": "RUN [\"LABEL\",\"maintainer=Megabyte\",\"Labs\",\"\\u003chelp@megabyte.space\"]",
          "system_commands": ["[\"LABEL\",\"maintainer=Megabyte\",\"Labs\",\"u003chelp@megabyte.space\"]"],
          "comment": "buildkit.dockerfile.v0"
        },
        {
          "type": "RUN",
          "time": "2021-06-16T07:18:32Z",
          "is_nop": false,
          "is_exec_form": true,
          "local_image_exists": false,
          "layer_index": 0,
          "size": 0,
          "command_snippet": "RUN [\"LABEL\",\"org.opencontainers.image.autho...",
          "command_all": "RUN [\"LABEL\",\"org.opencontainers.image.authors=Brian\",\"Zalewski\",\"\\u003cbrian@megabyte.space\\u003e\"]",
          "system_commands": [
            "[\"LABEL\",\"org.opencontainers.image.authors=Brian\",\"Zalewski\",\"u003cbrian@megabyte.spaceu003e\"]"
          ],
          "comment": "buildkit.dockerfile.v0"
        },
        {
          "type": "RUN",
          "time": "2021-06-16T07:18:32Z",
          "is_nop": false,
          "is_exec_form": true,
          "local_image_exists": false,
          "layer_index": 0,
          "size": 0,
          "command_snippet": "RUN [\"LABEL\",\"org.opencontainers.image.creat...",
          "command_all": "RUN [\"LABEL\",\"org.opencontainers.image.created=2021-06-16T03:19:51-04:00\"]",
          "system_commands": ["[\"LABEL\",\"org.opencontainers.image.created=2021-06-16T03:19:51-04:00\"]"],
          "comment": "buildkit.dockerfile.v0"
        },
        {
          "type": "RUN",
          "time": "2021-06-16T07:18:32Z",
          "is_nop": false,
          "is_exec_form": true,
          "local_image_exists": false,
          "layer_index": 0,
          "size": 0,
          "command_snippet": "RUN [\"LABEL\",\"org.opencontainers.image.descr...",
          "command_all": "RUN [\"LABEL\",\"org.opencontainers.image.description=A\",\"tiny\",\"container\",\"that\",\"only\",\"includes\",\"bash,\",\"curl,\",\"and\",\"jq\",\"intended\",\"for\",\"use\",\"in\",\"CI\",\"environments\",\"(only\",\"3.89211\",\"MB\",\"compressed!)\"]",
          "system_commands": [
            "[\"LABEL\",\"org.opencontainers.image.description=A\",\"tiny\",\"container\",\"that\",\"only\",\"includes\",\"bash,\",\"curl,\",\"and\",\"jq\",\"intended\",\"for\",\"use\",\"in\",\"CI\",\"environments\",\"(only\",\"3.89211\",\"MB\",\"compressed!)\"]"
          ],
          "comment": "buildkit.dockerfile.v0"
        },
        {
          "type": "RUN",
          "time": "2021-06-16T07:18:32Z",
          "is_nop": false,
          "is_exec_form": true,
          "local_image_exists": false,
          "layer_index": 0,
          "size": 0,
          "command_snippet": "RUN [\"LABEL\",\"org.opencontainers.image.docum...",
          "command_all": "RUN [\"LABEL\",\"org.opencontainers.image.documentation=https://gitlab.com/megabyte-labs/dockerfile/ci-pipeline/propagate/-/blob/master/README.md\"]",
          "system_commands": [
            "[\"LABEL\",\"org.opencontainers.image.documentation=https://gitlab.com/megabyte-labs/dockerfile/ci-pipeline/propagate/-/blob/master/README.md\"]"
          ],
          "comment": "buildkit.dockerfile.v0"
        },
        {
          "type": "RUN",
          "time": "2021-06-16T07:18:32Z",
          "is_nop": false,
          "is_exec_form": true,
          "local_image_exists": false,
          "layer_index": 0,
          "size": 0,
          "command_snippet": "RUN [\"LABEL\",\"org.opencontainers.image.licen...",
          "command_all": "RUN [\"LABEL\",\"org.opencontainers.image.licenses=MIT\"]",
          "system_commands": ["[\"LABEL\",\"org.opencontainers.image.licenses=MIT\"]"],
          "comment": "buildkit.dockerfile.v0"
        },
        {
          "type": "RUN",
          "time": "2021-06-16T07:18:32Z",
          "is_nop": false,
          "is_exec_form": true,
          "local_image_exists": false,
          "layer_index": 0,
          "size": 0,
          "command_snippet": "RUN [\"LABEL\",\"org.opencontainers.image.revis...",
          "command_all": "RUN [\"LABEL\",\"org.opencontainers.image.revision=9c5e3e563ff19076e30794ef58cb96c05d449ae9\"]",
          "system_commands": [
            "[\"LABEL\",\"org.opencontainers.image.revision=9c5e3e563ff19076e30794ef58cb96c05d449ae9\"]"
          ],
          "comment": "buildkit.dockerfile.v0"
        },
        {
          "type": "RUN",
          "time": "2021-06-16T07:18:32Z",
          "is_nop": false,
          "is_exec_form": true,
          "local_image_exists": false,
          "layer_index": 0,
          "size": 0,
          "command_snippet": "RUN [\"LABEL\",\"org.opencontainers.image.sourc...",
          "command_all": "RUN [\"LABEL\",\"org.opencontainers.image.source=https://gitlab.com/megabyte-labs/dockerfile/ci-pipeline/propagate.git\"]",
          "system_commands": [
            "[\"LABEL\",\"org.opencontainers.image.source=https://gitlab.com/megabyte-labs/dockerfile/ci-pipeline/propagate.git\"]"
          ],
          "comment": "buildkit.dockerfile.v0"
        },
        {
          "type": "RUN",
          "time": "2021-06-16T07:18:32Z",
          "is_nop": false,
          "is_exec_form": true,
          "local_image_exists": false,
          "layer_index": 0,
          "size": 0,
          "command_snippet": "RUN [\"LABEL\",\"org.opencontainers.image.url=h...",
          "command_all": "RUN [\"LABEL\",\"org.opencontainers.image.url=https://megabyte.space\"]",
          "system_commands": ["[\"LABEL\",\"org.opencontainers.image.url=https://megabyte.space\"]"],
          "comment": "buildkit.dockerfile.v0"
        },
        {
          "type": "RUN",
          "time": "2021-06-16T07:18:32Z",
          "is_nop": false,
          "is_exec_form": true,
          "local_image_exists": false,
          "layer_index": 0,
          "size": 0,
          "command_snippet": "RUN [\"LABEL\",\"org.opencontainers.image.vendo...",
          "command_all": "RUN [\"LABEL\",\"org.opencontainers.image.vendor=Megabyte\",\"Labs\"]",
          "system_commands": ["[\"LABEL\",\"org.opencontainers.image.vendor=Megabyte\",\"Labs\"]"],
          "comment": "buildkit.dockerfile.v0"
        },
        {
          "type": "RUN",
          "time": "2021-06-16T07:18:32Z",
          "is_nop": false,
          "is_exec_form": true,
          "local_image_exists": false,
          "layer_index": 0,
          "size": 0,
          "command_snippet": "RUN [\"LABEL\",\"org.opencontainers.image.versi...",
          "command_all": "RUN [\"LABEL\",\"org.opencontainers.image.version=0.0.8\"]",
          "system_commands": ["[\"LABEL\",\"org.opencontainers.image.version=0.0.8\"]"],
          "comment": "buildkit.dockerfile.v0"
        },
        {
          "type": "RUN",
          "time": "2021-06-16T07:18:32Z",
          "is_last_instruction": true,
          "is_nop": false,
          "is_exec_form": true,
          "local_image_exists": true,
          "layer_index": 0,
          "size": 0,
          "command_snippet": "RUN [\"LABEL\",\"space.megabyte.type=ci-pipelin...",
          "command_all": "RUN [\"LABEL\",\"space.megabyte.type=ci-pipeline\"]",
          "system_commands": ["[\"LABEL\",\"space.megabyte.type=ci-pipeline\"]"],
          "comment": "buildkit.dockerfile.v0",
          "raw_tags": ["megabytelabs/propagate:0.0.8", "megabytelabs/propagate:latest"]
        }
      ]
    }
  ]
}
