{
  "version": "1.0",
  "engine": "darwin|Transformer|1.35.0|latest|latest",
  "containerized": false,
  "host_distro": {
    "name": "",
    "version": "",
    "display_name": "Big Sur (11.3)"
  },
  "type": "build",
  "state": "done",
  "target_reference": "megabytelabs/gitlab-ci-lint:latest",
  "system": {
    "type": "Linux",
    "release": "5.10.25-linuxkit",
    "distro": {
      "name": "Alpine Linux",
      "version": "3.14.0",
      "display_name": "Alpine Linux v3.14"
    }
  },
  "source_image": {
    "identity": {
      "id": "sha256:a03c9becd94250f01ddc9ec9773086dcfe9fa867c9fe26aa39f73580ea00dac0",
      "tags": ["1.1.0", "latest"],
      "names": ["megabytelabs/gitlab-ci-lint:1.1.0", "megabytelabs/gitlab-ci-lint:latest"]
    },
    "size": 63082557,
    "size_human": "63 MB",
    "create_time": "2021-06-16T01:46:52Z",
    "docker_version": "",
    "architecture": "amd64",
    "os": "linux",
    "labels": {
      "maintainer": "Megabyte Labs <help@megabyte.space",
      "org.opencontainers.image.authors": "Brian Zalewski <brian@megabyte.space>",
      "org.opencontainers.image.created": "2021-06-16T03:03:31-04:00",
      "org.opencontainers.image.description": "A compact GitLab CI Lint container that you can use in CI environments as well as from the command-line as a one-liner (only 17.1219 MB compressed!)",
      "org.opencontainers.image.documentation": "https://gitlab.com/megabyte-labs/dockerfile/ci-pipeline/gitlab-ci-lint/-/blob/master/README.md",
      "org.opencontainers.image.licenses": "MIT",
      "org.opencontainers.image.revision": "70f4e1cb458fe2270da1e8c5238b5cad7feb02ec",
      "org.opencontainers.image.source": "https://gitlab.com/megabyte-labs/dockerfile/ci-pipeline/gitlab-ci-lint.git",
      "org.opencontainers.image.url": "https://megabyte.space",
      "org.opencontainers.image.vendor": "Megabyte Labs",
      "org.opencontainers.image.version": "1.1.0",
      "space.megabyte.type": "ci-pipeline"
    },
    "env_vars": [
      "PATH=/usr/local/sbin:/usr/local/bin:/usr/sbin:/usr/bin:/sbin:/bin",
      "container=docker",
      "NODE_EXTRA_CA_CERTS=/etc/ssl/certs/ca-certificates.crt"
    ]
  },
  "minified_image_size": 45910050,
  "minified_image_size_human": "46 MB",
  "minified_image": "megabytelabs/gitlab-ci-lint:slim",
  "minified_image_has_data": true,
  "minified_by": 1.3740467936758944,
  "artifact_location": "/tmp/docker-slim-state/.docker-slim-state/images/a03c9becd94250f01ddc9ec9773086dcfe9fa867c9fe26aa39f73580ea00dac0/artifacts",
  "container_report_name": "creport.json",
  "seccomp_profile_name": "megabytelabs-gitlab-ci-lint-seccomp.json",
  "apparmor_profile_name": "megabytelabs-gitlab-ci-lint-apparmor-profile",
  "image_stack": [
    {
      "is_top_image": true,
      "id": "sha256:a03c9becd94250f01ddc9ec9773086dcfe9fa867c9fe26aa39f73580ea00dac0",
      "full_name": "megabytelabs/gitlab-ci-lint:1.1.0",
      "repo_name": "megabytelabs/gitlab-ci-lint",
      "version_tag": "1.1.0",
      "raw_tags": ["megabytelabs/gitlab-ci-lint:1.1.0", "megabytelabs/gitlab-ci-lint:latest"],
      "create_time": "2021-06-16T01:46:52Z",
      "new_size": 63082557,
      "new_size_human": "63 MB",
      "instructions": [
        {
          "type": "ADD",
          "time": "2021-06-15T22:19:37Z",
          "is_nop": true,
          "local_image_exists": false,
          "layer_index": 0,
          "size": 5595013,
          "size_human": "5.6 MB",
          "params": "file:f278386b0cef68136129f5f58c52445590a417b624d62bca158d4dc926c340df in /",
          "command_snippet": "ADD file:f278386b0cef68136129f5f58c52445590a...",
          "command_all": "ADD file:f278386b0cef68136129f5f58c52445590a417b624d62bca158d4dc926c340df /",
          "target": "/",
          "source_type": "file"
        },
        {
          "type": "CMD",
          "time": "2021-06-15T22:19:37Z",
          "is_nop": true,
          "is_exec_form": true,
          "local_image_exists": false,
          "layer_index": 0,
          "size": 0,
          "params": "[\"/bin/sh\"]",
          "command_snippet": "CMD [\"/bin/sh\"]",
          "command_all": "CMD [\"/bin/sh\"]"
        },
        {
          "type": "RUN",
          "time": "2021-06-16T01:46:52Z",
          "is_nop": false,
          "is_exec_form": true,
          "local_image_exists": false,
          "layer_index": 0,
          "size": 0,
          "command_snippet": "RUN [\"ENV\",\"container=docker\"]",
          "command_all": "RUN [\"ENV\",\"container=docker\"]",
          "system_commands": ["[\"ENV\",\"container=docker\"]"],
          "comment": "buildkit.dockerfile.v0"
        },
        {
          "type": "RUN",
          "time": "2021-06-16T01:46:52Z",
          "is_nop": false,
          "is_exec_form": true,
          "local_image_exists": false,
          "layer_index": 0,
          "size": 0,
          "command_snippet": "RUN [\"ENV\",\"NODE_EXTRA_CA_CERTS=/etc/ssl/cer...",
          "command_all": "RUN [\"ENV\",\"NODE_EXTRA_CA_CERTS=/etc/ssl/certs/ca-certificates.crt\"]",
          "system_commands": ["[\"ENV\",\"NODE_EXTRA_CA_CERTS=/etc/ssl/certs/ca-certificates.crt\"]"],
          "comment": "buildkit.dockerfile.v0"
        },
        {
          "type": "RUN",
          "time": "2021-06-16T01:46:52Z",
          "is_nop": false,
          "is_exec_form": true,
          "local_image_exists": false,
          "layer_index": 0,
          "size": 57487544,
          "size_human": "58 MB",
          "command_snippet": "RUN [\"RUN\",\"/bin/sh\",\"-c\",\"apk\",\"--no-cache\"...",
          "command_all": "RUN [\"RUN\",\"/bin/sh\",\"-c\",\"apk\",\"--no-cache\",\"add\",\"nodejs~=14\",\"npm~=7\",\"\\u0026\\u0026\",\"npm\",\"install\",\"-g\",\"gitlab-ci-lint@latest\"]",
          "system_commands": [
            "[\"RUN\",\"/bin/sh\",\"-c\",\"apk\",\"--no-cache\",\"add\",\"nodejs~=14\",\"npm~=7\",\"u0026u0026\",\"npm\",\"install\",\"-g\",\"gitlab-ci-lint@latest\"]"
          ],
          "comment": "buildkit.dockerfile.v0"
        },
        {
          "type": "RUN",
          "time": "2021-06-16T01:46:52Z",
          "is_nop": false,
          "is_exec_form": true,
          "local_image_exists": false,
          "layer_index": 0,
          "size": 0,
          "command_snippet": "RUN [\"WORKDIR\",\"/work\"]",
          "command_all": "RUN [\"WORKDIR\",\"/work\"]",
          "system_commands": ["[\"WORKDIR\",\"/work\"]"],
          "comment": "buildkit.dockerfile.v0"
        },
        {
          "type": "RUN",
          "time": "2021-06-16T01:46:52Z",
          "is_nop": false,
          "is_exec_form": true,
          "local_image_exists": false,
          "layer_index": 0,
          "size": 0,
          "command_snippet": "RUN [\"ENTRYPOINT\",\"[gitlab-ci-lint]\"]",
          "command_all": "RUN [\"ENTRYPOINT\",\"[gitlab-ci-lint]\"]",
          "system_commands": ["[\"ENTRYPOINT\",\"[gitlab-ci-lint]\"]"],
          "comment": "buildkit.dockerfile.v0"
        },
        {
          "type": "RUN",
          "time": "2021-06-16T01:46:52Z",
          "is_nop": false,
          "is_exec_form": true,
          "local_image_exists": false,
          "layer_index": 0,
          "size": 0,
          "command_snippet": "RUN [\"CMD\",\"[--version]\"]",
          "command_all": "RUN [\"CMD\",\"[--version]\"]",
          "system_commands": ["[\"CMD\",\"[--version]\"]"],
          "comment": "buildkit.dockerfile.v0"
        },
        {
          "type": "RUN",
          "time": "2021-06-16T01:46:52Z",
          "is_nop": false,
          "is_exec_form": true,
          "local_image_exists": false,
          "layer_index": 0,
          "size": 0,
          "command_snippet": "RUN [\"ARG\",\"BUILD_DATE\"]",
          "command_all": "RUN [\"ARG\",\"BUILD_DATE\"]",
          "system_commands": ["[\"ARG\",\"BUILD_DATE\"]"],
          "comment": "buildkit.dockerfile.v0"
        },
        {
          "type": "RUN",
          "time": "2021-06-16T01:46:52Z",
          "is_nop": false,
          "is_exec_form": true,
          "local_image_exists": false,
          "layer_index": 0,
          "size": 0,
          "command_snippet": "RUN [\"ARG\",\"REVISION\"]",
          "command_all": "RUN [\"ARG\",\"REVISION\"]",
          "system_commands": ["[\"ARG\",\"REVISION\"]"],
          "comment": "buildkit.dockerfile.v0"
        },
        {
          "type": "RUN",
          "time": "2021-06-16T01:46:52Z",
          "is_nop": false,
          "is_exec_form": true,
          "local_image_exists": false,
          "layer_index": 0,
          "size": 0,
          "command_snippet": "RUN [\"ARG\",\"VERSION\"]",
          "command_all": "RUN [\"ARG\",\"VERSION\"]",
          "system_commands": ["[\"ARG\",\"VERSION\"]"],
          "comment": "buildkit.dockerfile.v0"
        },
        {
          "type": "RUN",
          "time": "2021-06-16T01:46:52Z",
          "is_nop": false,
          "is_exec_form": true,
          "local_image_exists": false,
          "layer_index": 0,
          "size": 0,
          "command_snippet": "RUN [\"LABEL\",\"maintainer=Megabyte\",\"Labs\",\"\\...",
          "command_all": "RUN [\"LABEL\",\"maintainer=Megabyte\",\"Labs\",\"\\u003chelp@megabyte.space\"]",
          "system_commands": ["[\"LABEL\",\"maintainer=Megabyte\",\"Labs\",\"u003chelp@megabyte.space\"]"],
          "comment": "buildkit.dockerfile.v0"
        },
        {
          "type": "RUN",
          "time": "2021-06-16T01:46:52Z",
          "is_nop": false,
          "is_exec_form": true,
          "local_image_exists": false,
          "layer_index": 0,
          "size": 0,
          "command_snippet": "RUN [\"LABEL\",\"org.opencontainers.image.autho...",
          "command_all": "RUN [\"LABEL\",\"org.opencontainers.image.authors=Brian\",\"Zalewski\",\"\\u003cbrian@megabyte.space\\u003e\"]",
          "system_commands": [
            "[\"LABEL\",\"org.opencontainers.image.authors=Brian\",\"Zalewski\",\"u003cbrian@megabyte.spaceu003e\"]"
          ],
          "comment": "buildkit.dockerfile.v0"
        },
        {
          "type": "RUN",
          "time": "2021-06-16T01:46:52Z",
          "is_nop": false,
          "is_exec_form": true,
          "local_image_exists": false,
          "layer_index": 0,
          "size": 0,
          "command_snippet": "RUN [\"LABEL\",\"org.opencontainers.image.creat...",
          "command_all": "RUN [\"LABEL\",\"org.opencontainers.image.created=2021-06-16T03:03:31-04:00\"]",
          "system_commands": ["[\"LABEL\",\"org.opencontainers.image.created=2021-06-16T03:03:31-04:00\"]"],
          "comment": "buildkit.dockerfile.v0"
        },
        {
          "type": "RUN",
          "time": "2021-06-16T01:46:52Z",
          "is_nop": false,
          "is_exec_form": true,
          "local_image_exists": false,
          "layer_index": 0,
          "size": 0,
          "command_snippet": "RUN [\"LABEL\",\"org.opencontainers.image.descr...",
          "command_all": "RUN [\"LABEL\",\"org.opencontainers.image.description=A\",\"compact\",\"GitLab\",\"CI\",\"Lint\",\"container\",\"that\",\"you\",\"can\",\"use\",\"in\",\"CI\",\"environments\",\"as\",\"well\",\"as\",\"from\",\"the\",\"command-line\",\"as\",\"a\",\"one-liner\",\"(only\",\"17.1219\",\"MB\",\"compressed!)\"]",
          "system_commands": [
            "[\"LABEL\",\"org.opencontainers.image.description=A\",\"compact\",\"GitLab\",\"CI\",\"Lint\",\"container\",\"that\",\"you\",\"can\",\"use\",\"in\",\"CI\",\"environments\",\"as\",\"well\",\"as\",\"from\",\"the\",\"command-line\",\"as\",\"a\",\"one-liner\",\"(only\",\"17.1219\",\"MB\",\"compressed!)\"]"
          ],
          "comment": "buildkit.dockerfile.v0"
        },
        {
          "type": "RUN",
          "time": "2021-06-16T01:46:52Z",
          "is_nop": false,
          "is_exec_form": true,
          "local_image_exists": false,
          "layer_index": 0,
          "size": 0,
          "command_snippet": "RUN [\"LABEL\",\"org.opencontainers.image.docum...",
          "command_all": "RUN [\"LABEL\",\"org.opencontainers.image.documentation=https://gitlab.com/megabyte-labs/dockerfile/ci-pipeline/gitlab-ci-lint/-/blob/master/README.md\"]",
          "system_commands": [
            "[\"LABEL\",\"org.opencontainers.image.documentation=https://gitlab.com/megabyte-labs/dockerfile/ci-pipeline/gitlab-ci-lint/-/blob/master/README.md\"]"
          ],
          "comment": "buildkit.dockerfile.v0"
        },
        {
          "type": "RUN",
          "time": "2021-06-16T01:46:52Z",
          "is_nop": false,
          "is_exec_form": true,
          "local_image_exists": false,
          "layer_index": 0,
          "size": 0,
          "command_snippet": "RUN [\"LABEL\",\"org.opencontainers.image.licen...",
          "command_all": "RUN [\"LABEL\",\"org.opencontainers.image.licenses=MIT\"]",
          "system_commands": ["[\"LABEL\",\"org.opencontainers.image.licenses=MIT\"]"],
          "comment": "buildkit.dockerfile.v0"
        },
        {
          "type": "RUN",
          "time": "2021-06-16T01:46:52Z",
          "is_nop": false,
          "is_exec_form": true,
          "local_image_exists": false,
          "layer_index": 0,
          "size": 0,
          "command_snippet": "RUN [\"LABEL\",\"org.opencontainers.image.revis...",
          "command_all": "RUN [\"LABEL\",\"org.opencontainers.image.revision=70f4e1cb458fe2270da1e8c5238b5cad7feb02ec\"]",
          "system_commands": [
            "[\"LABEL\",\"org.opencontainers.image.revision=70f4e1cb458fe2270da1e8c5238b5cad7feb02ec\"]"
          ],
          "comment": "buildkit.dockerfile.v0"
        },
        {
          "type": "RUN",
          "time": "2021-06-16T01:46:52Z",
          "is_nop": false,
          "is_exec_form": true,
          "local_image_exists": false,
          "layer_index": 0,
          "size": 0,
          "command_snippet": "RUN [\"LABEL\",\"org.opencontainers.image.sourc...",
          "command_all": "RUN [\"LABEL\",\"org.opencontainers.image.source=https://gitlab.com/megabyte-labs/dockerfile/ci-pipeline/gitlab-ci-lint.git\"]",
          "system_commands": [
            "[\"LABEL\",\"org.opencontainers.image.source=https://gitlab.com/megabyte-labs/dockerfile/ci-pipeline/gitlab-ci-lint.git\"]"
          ],
          "comment": "buildkit.dockerfile.v0"
        },
        {
          "type": "RUN",
          "time": "2021-06-16T01:46:52Z",
          "is_nop": false,
          "is_exec_form": true,
          "local_image_exists": false,
          "layer_index": 0,
          "size": 0,
          "command_snippet": "RUN [\"LABEL\",\"org.opencontainers.image.url=h...",
          "command_all": "RUN [\"LABEL\",\"org.opencontainers.image.url=https://megabyte.space\"]",
          "system_commands": ["[\"LABEL\",\"org.opencontainers.image.url=https://megabyte.space\"]"],
          "comment": "buildkit.dockerfile.v0"
        },
        {
          "type": "RUN",
          "time": "2021-06-16T01:46:52Z",
          "is_nop": false,
          "is_exec_form": true,
          "local_image_exists": false,
          "layer_index": 0,
          "size": 0,
          "command_snippet": "RUN [\"LABEL\",\"org.opencontainers.image.vendo...",
          "command_all": "RUN [\"LABEL\",\"org.opencontainers.image.vendor=Megabyte\",\"Labs\"]",
          "system_commands": ["[\"LABEL\",\"org.opencontainers.image.vendor=Megabyte\",\"Labs\"]"],
          "comment": "buildkit.dockerfile.v0"
        },
        {
          "type": "RUN",
          "time": "2021-06-16T01:46:52Z",
          "is_nop": false,
          "is_exec_form": true,
          "local_image_exists": false,
          "layer_index": 0,
          "size": 0,
          "command_snippet": "RUN [\"LABEL\",\"org.opencontainers.image.versi...",
          "command_all": "RUN [\"LABEL\",\"org.opencontainers.image.version=1.1.0\"]",
          "system_commands": ["[\"LABEL\",\"org.opencontainers.image.version=1.1.0\"]"],
          "comment": "buildkit.dockerfile.v0"
        },
        {
          "type": "RUN",
          "time": "2021-06-16T01:46:52Z",
          "is_last_instruction": true,
          "is_nop": false,
          "is_exec_form": true,
          "local_image_exists": true,
          "layer_index": 0,
          "size": 0,
          "command_snippet": "RUN [\"LABEL\",\"space.megabyte.type=ci-pipelin...",
          "command_all": "RUN [\"LABEL\",\"space.megabyte.type=ci-pipeline\"]",
          "system_commands": ["[\"LABEL\",\"space.megabyte.type=ci-pipeline\"]"],
          "comment": "buildkit.dockerfile.v0",
          "raw_tags": ["megabytelabs/gitlab-ci-lint:1.1.0", "megabytelabs/gitlab-ci-lint:latest"]
        }
      ]
    }
  ]
}
