{
  apps: [{
    name: 'Daemon',
    script: './electroneumd',
    watch: false,
    args: '--rpc-bind-ip=172.27.0.5 --rpc-bind-port=26968 --confirm-external-bind --restricted-rpc'
  },
  {
    name: 'Wallet',
    script: './electroneum-wallet-rpc',
    watch: false,
    args: '--daemon-host=172.27.0.5 --daemon-port=26968 --rpc-bind-port=26969 --rpc-bind-ip=172.27.0.5 --password=uGnWvuvG3XJGcTByOTCtXfqcMcaYz2hW9WyJ0Lcsgojz73yWVb --wallet-file=/root/wallets/etn-pool --disable-rpc-login --trusted-daemon --confirm-external-bind'
  }]

}
