{
  apps: [{
    name: 'Wallet',
    script: './monero-wallet-rpc',
    watch: false,
    args: '--rpc-bind-ip 172.25.0.5 --disable-rpc-login --daemon-address=172.25.0.5:18081 --rpc-bind-port 18082 --password 0Uso635FihspwnVI5q4jvzKtcMCv7qB5segNNoBKXXAeIaaNZK --wallet-file /root/wallets/xmr-pool --trusted-daemon --confirm-external-bind'
  }, {
    name: 'Daemon',
    script: './monerod',
    watch: false,
    args: '--rpc-bind-ip 172.25.0.5 --rpc-bind-port 18081 --confirm-external-bind --restricted-rpc'
}]

}
