{
  "dockerPublish": true,
  "docs": {
    "header_description_pre": "An NPM CLI maintained by ",
    "link": "https://megabyte.space/docs/npm/cli"
  },
  "repository": {
    "prefix": {
      "github": "npm-"
    }
  },
  "scriptsBuild": "nest build",
  "subgroup": "cli"
}
