{
  "docs": {
    "header_description_pre": "Docusaurus Meets ",
    "link": "https://megabyte.space/docs/"
  },
  "plugins": {
    "eslint": [
      ["ESLint Plugin", "Description"],
      [
        "[`@typescript-eslint/eslint-plugin`](https://npmjs.com/package/@typescript-eslint/eslint-plugin)",
        "An ESLint plugin which provides lint rules for TypeScript codebases"
      ],
      [
        "[`@typescript-eslint/eslint-plugin-tslint`](https://npmjs.com/package/@typescript-eslint/eslint-plugin-tslint)",
        "ESLint plugin that wraps a TSLint configuration and lints the whole source using TSLint"
      ],
      [
        "[`@typescript-eslint/parser`](https://npmjs.com/package/@typescript-eslint/parser)",
        "An ESLint parser which leverages TypeScript ESTree to allow for ESLint to lint TypeScript source code"
      ],
      [
        "[`eslint-config-prettier`](https://npmjs.com/package/eslint-config-prettier)",
        "Turns off all rules that are unnecessary or might conflict with Prettier"
      ],
      [
        "[`eslint-formatter-git-log`](https://npmjs.com/package/eslint-formatter-git-log)",
        "Formatter that displays results that include the name of the developer who is responsible for the error"
      ],
      [
        "[`eslint-formatter-gitlab`](https://npmjs.com/package/eslint-formatter-gitlab)",
        "Formatter for GitLab CI that integrates results into merge requests"
      ],
      [
        "[`eslint-formatter-pretty`](https://npmjs.com/package/eslint-formatter-pretty)",
        "Stylish formatter for terminal results that includes features such as clicking result to open code in editor"
      ],
      [
        "[`eslint-formatter-summary`](https://npmjs.com/package/eslint-formatter-summary)",
        "Alternate formatting style for the results that displays a table"
      ],
      ["[`eslint-plugin-angular`](https://npmjs.com/package/eslint-plugin-angular)", "Rules for Angular applications"],
      [
        "[`eslint-plugin-array-func`](https://npmjs.com/package/eslint-plugin-array-func)",
        "Rules for Array functions and methods"
      ],
      [
        "[`eslint-plugin-editorconfig`](https://npmjs.com/package/eslint-plugin-editorconfig)",
        "An ESLint plugin to enforce EditorConfig rules"
      ],
      [
        "[`eslint-plugin-eslint-comments`](https://npmjs.com/package/eslint-plugin-eslint-comments)",
        "Additional ESLint rules for ESLint directive comments"
      ],
      [
        "[`eslint-plugin-etc`](https://npmjs.com/package/eslint-plugin-etc)",
        "More generalcpurpose TypeScript-related ESLint rules"
      ],
      ["[`eslint-plugin-ext`](https://npmjs.com/package/eslint-plugin-ext)", "eslint extended rules"],
      [
        "[`eslint-plugin-filenames`](https://npmjs.com/package/eslint-plugin-filenames)",
        "ESLint plugin to check filenames"
      ],
      ["[`eslint-plugin-fp`](https://npmjs.com/package/eslint-plugin-fp)", "ESLint rules for functional programming"],
      [
        "[`eslint-plugin-functional`](https://npmjs.com/package/eslint-plugin-functional)",
        "ESLint plugin to disable mutation and promote functional programming in JavaScript and TypeScript"
      ],
      [
        "[`eslint-plugin-import`](https://npmjs.com/package/eslint-plugin-import)",
        "ESLint plugin with rules that help validate proper imports"
      ],
      ["[`eslint-plugin-jest`](https://npmjs.com/package/eslint-plugin-jest)", "ESLint plugin for Jest "],
      [
        "[`eslint-plugin-jest-async`](https://npmjs.com/package/eslint-plugin-jest-async)",
        "ESLint rules for Jest to detect improper test assertions for asynchronous actions"
      ],
      ["[`eslint-plugin-jest-dom`](https://npmjs.com/package/eslint-plugin-dom)", "Lint DOM API performance"],
      [
        "[`eslint-plugin-jest-formatting`](https://npmjs.com/package/eslint-plugin-formatting)",
        "Linting rules for ESLint realted to code style formatting"
      ],
      [
        "[`eslint-plugin-jsdoc`](https://npmjs.com/package/eslint-plugin-jsdoc)",
        "Rules that enforce comments written in JSDoc syntax"
      ],
      [
        "[`eslint-plugin-json-schema-validator`](https://npmjs.com/package/eslint-plugin-json-schema-validator)",
        "ESLint plugin that validates data using JSON Schema Validator"
      ],
      [
        "[`eslint-plugin-jsonc`](https://npmjs.com/package/eslint-plugin-jsonc)",
        "ESLint plugin for JSON, JSONC and JSON5 files"
      ],
      [
        "[`eslint-plugin-no-constructor-bind`](https://npmjs.com/package/eslint-plugin-no-constructor-bind)",
        "Prefer class arrow functions to binding in the constructor"
      ],
      [
        "[`eslint-plugin-no-explicit-type-exports`](https://npmjs.com/package/eslint-plugin-no-explicit-type-exports)",
        "A plugin to guard against exporting imported types"
      ],
      [
        "[`eslint-plugin-no-secrets`](https://npmjs.com/package/eslint-plugin-no-secrets)",
        "An ESLint plugin to find strings that might be secrets or credentials"
      ],
      [
        "[`eslint-plugin-no-unsanitized`](https://npmjs.com/package/eslint-plugin-no-unsanitized)",
        "Custom ESLint rule to disallows unsafe innerHTML, outerHTML, insertAdjacentHTML and alike"
      ],
      [
        "[`eslint-plugin-no-use-extend-native`](https://npmjs.com/package/eslint-plugin-no-use-extend-native)",
        "ESLint plugin to prevent use of extended native objects"
      ],
      ["[`eslint-plugin-node`](https://npmjs.com/package/eslint-plugin-node)", "Additional ESLint's rules for Node.js"],
      [
        "[`eslint-plugin-optimize-regex`](https://npmjs.com/package/eslint-plugin-optimize-regex)",
        "Optimize regex literals"
      ],
      [
        "[`eslint-plugin-prefer-arrow`](https://npmjs.com/package/eslint-plugin-prefer-arrow)",
        "ESLint plugin to prefer arrow functions"
      ],
      [
        "[`eslint-plugin-prettier`](https://npmjs.com/package/eslint-plugin-prettier)",
        "ESLint plugin to prefer arrow functions"
      ],
      [
        "[`eslint-plugin-promise`](https://npmjs.com/package/eslint-plugin-promise)",
        "Enforce best practices for JavaScript promises"
      ],
      [
        "[`eslint-plugin-regexp`](https://npmjs.com/package/eslint-plugin-regexp)",
        "ESLint plugin for finding RegExp mistakes and RegExp style guide violations"
      ],
      ["[`eslint-plugin-rxjs`](https://npmjs.com/package/eslint-plugin-rxjs)", "ESLint rules for RxJS "],
      [
        "[`eslint-plugin-security`](https://npmjs.com/package/eslint-plugin-security)",
        "ESLint rules for Node Security"
      ],
      ["[`eslint-plugin-sonarjs`](https://npmjs.com/package/eslint-plugin-sonarjs)", "SonarJS rules for ESLint "],
      [
        "[`eslint-plugin-sort-class-members`](https://npmjs.com/package/eslint-plugin-sort-class-members)",
        "ESLint rule for enforcing consistent ES6 class member order"
      ],
      [
        "[`eslint-plugin-sort-keys-fix`](https://npmjs.com/package/eslint-plugin-sort-keys-fix)",
        "Fork of eslint rule that sorts keys in objects with autofix enabled"
      ],
      [
        "[`eslint-plugin-switch-case`](https://npmjs.com/package/eslint-plugin-switch-case)",
        "Switch-case-specific linting rules for ESLint"
      ],
      [
        "[`eslint-plugin-toml`](https://npmjs.com/package/eslint-plugin-toml)",
        "ESLint plugin provides linting rules for TOML"
      ],
      [
        "[`eslint-plugin-tsdoc`](https://npmjs.com/package/eslint-plugin-tsdoc)",
        "This ESLint plugin provides a rule for validating that TypeScript doc comments conform to the TSDoc specification"
      ],
      [
        "[`eslint-plugin-typescript-sort-keys`](https://npmjs.com/package/eslint-plugin-typescript-sort-keys)",
        "A linter plugin to require sorting interface and string enum keys"
      ],
      ["[`eslint-plugin-unicorn`](https://npmjs.com/package/eslint-plugin-unicorn)", "Various awesome ESLint rules"],
      [
        "[`eslint-plugin-unused-imports`](https://npmjs.com/package/eslint-plugin-unused-imports)",
        "Package to seperate no-unused-vars and no-unused-imports for ESLint as well as providing an autofixer for the latter"
      ],
      [
        "[`eslint-plugin-woke`](https://npmjs.com/package/eslint-plugin-woke)",
        "ESLint plugin to promote diversity and inclusion in codebases by restricting the presence of certain potentially offensive keywords"
      ],
      [
        "[`eslint-plugin-yml`](https://npmjs.com/package/eslint-plugin-yml)",
        "ESLint plugin provides linting rules for YAML"
      ]
    ],
    "jest": [
      ["Jest Plugin", "Description"],
      [
        "[`@jest-runner/electron`](https://npmjs.com/package/@jest-runner/electron)",
        "custom test runner for Jest that allows tests to be run in Electron environment"
      ],
      [
        "[`@storybook/addon-storyshots`](https://npmjs.com/package/@storybook/addon-storyshots)",
        "StoryShots adds automatic Jest Snapshot Testing for Storybook"
      ],
      ["[`expect-puppeteer`](https://npmjs.com/package/expect-puppeteer)", "Run the tests using Jest & Puppeteer"],
      [
        "[`jest-chain`](https://npmjs.com/package/jest-chain)",
        "Chain Jest matchers together to create one powerful assertion"
      ],
      ["[`jest-dom`](https://npmjs.com/package/jest-dom)", "Custom jest matchers to test the state of the DOM"],
      [
        "[`jest-html-reporters`](https://npmjs.com/package/jest-html-reporters)",
        "Jest test results processor for generating a summary in HTML"
      ],
      ["[`jest-image-snapshot`](https://npmjs.com/package/jest-image-snapshot)", "Jest matcher for image comparisons"],
      ["[`jest-json-schema`](https://npmjs.com/package/jest-json-schema)", "JSON schema matcher for Jest"],
      [
        "[`jest-preset-angular`](https://npmjs.com/package/jest-preset-angular)",
        "A preset of Jest configuration for Angular projects"
      ],
      [
        "[`jest-puppeteer`](https://npmjs.com/package/jest-puppeteer)",
        "Jest preset containing all required configuration for writing integration tests using Puppeteer"
      ],
      ["[`jest-runner-eslint`](https://npmjs.com/package/jest-runner-eslint)", "ESLint runner for Jest"],
      [
        "[`jest-runner-groups`](https://npmjs.com/package/jest-runner-groups)",
        "A custom runner that allows to tag test files and run groups of tests with Jest"
      ],
      ["[`jest-runner-prettier`](https://npmjs.com/package/jest-runner-prettier)", "Prettier runner for Jest"],
      ["[`jest-runner-stylelint`](https://npmjs.com/package/jest-runner-stylelint)", "Stylelint runner for Jest"],
      ["[`jest-runner-tsc`](https://npmjs.com/package/jest-runner-tsc)", "A Jest runner for the TypeScript compiler"],
      [
        "[`jest-watch-master`](https://npmjs.com/package/jest-watch-master)",
        "Jest watch plugin for checking changes since master"
      ],
      [
        "[`jest-watch-select-projects`](https://npmjs.com/package/jest-watch-select-projects)",
        "Select which Jest projects to run"
      ],
      [
        "[`jest-watch-typeahead`](https://npmjs.com/package/jest-watch-typeahead)",
        "Jest watch plugin for filtering test by file name or test name"
      ]
    ],
    "prettier": [
      ["Prettier Plugin", "Description", "File Types"],
      ["[`@prettier/plugin-php`](https://npmjs.com/package/@prettier/plugin-php)", "Adds support for PHP", "`*.php`"],
      [
        "[`@prettier/plugin-pug`](https://npmjs.com/package/@prettier/plugin-pug)",
        "Adds support for Pug templates",
        "`*.jade`, `*.pug`"
      ],
      [
        "[`@prettier/plugin-ruby`](https://npmjs.com/package/@prettier/plugin-ruby)",
        "Adds support for Ruby",
        "`*.rb` and [many more](https://github.com/prettier/plugin-ruby/blob/main/src/plugin.ts#L20)"
      ],
      [
        "[`@prettier/plugin-xml`](https://npmjs.com/package/@prettier/plugin-xml)",
        "A prettier plugin for XML",
        "`*.xml` and [many more](https://github.com/prettier/plugin-xml/blob/main/src/plugin.ts#L59)"
      ],
      [
        "[`prettier-plugin-go-template`](https://npmjs.com/package/prettier-plugin-go-template)",
        "Adds support for Go templates",
        "`*.gohtml`, `*.gotmpl`, `*.go.tmpl`, `*.tmpl`, `*.tpl`, `*.html.tmpl`, `*.go.html`"
      ],
      [
        "[`prettier-plugin-csharp`](https://npmjs.com/package/prettier-plugin-csharp)",
        "Adds support for C#",
        "`*.cs`, `*.cake`, `*.cshtml`, `*.csx`"
      ],
      [
        "[`prettier-plugin-ini`](https://npmjs.com/package/prettier-plugin-ini)",
        "Adds support for INI files",
        "`*.ini`"
      ],
      ["[`prettier-plugin-java`](https://npmjs.com/package/prettier-plugin-java)", "Adds support for Java", "`*.java`"],
      [
        "[`prettier-plugin-jsdoc`](https://npmjs.com/package/prettier-plugin-jsdoc)",
        "Adds support for JSDoc comments in TypeScript/JavaScript files",
        "`*.js`, `*.ts`, `*.jsx`, `*.tsx`, `*.mdx`, possibly others"
      ],
      [
        "[`prettier-plugin-organize-imports`](https://npmjs.com/package/prettier-plugin-organize-imports)",
        "Makes Prettier organize your TypeScript imports using the `organizeImports` feature of the TypeScript language service API",
        "`*.js`, `*.jsx`, `*.ts`, `*.tsx`, `*.vue`"
      ],
      [
        "[`prettier-plugin-package-perfection`](https://npmjs.com/package/prettier-plugin-package-perfection)",
        "Sorts the keys and does some auto-formatting of the `package.json` file (uses [prettier-package-json](https://www.npmjs.com/package/prettier-package-json) for the logic)",
        "`package.json`"
      ],
      [
        "[`prettier-plugin-properties`](https://npmjs.com/package/prettier-plugin-properties)",
        "Adds support for `properties` files",
        "`*.properties`"
      ],
      [
        "[`prettier-plugin-sh`](https://npmjs.com/package/prettier-plugin-sh)",
        "Adds support for running Prettier on shell scripts",
        "`*.sh`, `Dockerfile`, `.gitignore`, `.dotenv`, possibly more"
      ],
      [
        "[`prettier-plugin-solidity`](https://npmjs.com/package/prettier-plugin-solidity)",
        "Adds support for Solidity code",
        "`*.sol`"
      ],
      ["[`prettier-plugin-sql`](https://npmjs.com/package/prettier-plugin-sql)", "Adds support for SQL", "`*.sql`"],
      ["[`prettier-plugin-toml`](https://npmjs.com/package/prettier-plugin-toml)", "Adds support for TOML", "`*.toml`"]
    ]
  },
  "repository": {
    "prefix": {
      "github": ""
    }
  },
  "subgroup": "docusaurus"
}
