Version 4
SHEET 1 880 680
WIRE 48 32 32 32
WIRE 160 32 128 32
WIRE -336 48 -336 16
WIRE -336 48 -400 48
WIRE -272 48 -336 48
WIRE 400 48 384 48
WIRE 512 48 480 48
WIRE -400 112 -400 48
WIRE -272 144 -272 128
WIRE -240 144 -272 144
WIRE 96 144 96 128
WIRE -240 160 -240 144
WIRE -80 160 -128 160
WIRE 32 160 32 32
WIRE 32 160 0 160
WIRE 64 160 32 160
WIRE 448 160 448 144
WIRE -272 176 -272 144
WIRE -128 176 -128 160
WIRE 160 176 160 32
WIRE 160 176 128 176
WIRE 240 176 160 176
WIRE 272 176 240 176
WIRE 368 176 352 176
WIRE 384 176 384 48
WIRE 384 176 368 176
WIRE 416 176 384 176
WIRE 64 192 48 192
WIRE 512 192 512 48
WIRE 512 192 480 192
WIRE 560 192 512 192
WIRE 416 208 400 208
WIRE 96 224 96 208
WIRE 448 240 448 224
WIRE -400 256 -400 192
WIRE -336 256 -400 256
WIRE -272 256 -336 256
WIRE 48 256 48 192
WIRE 400 256 400 208
WIRE -128 272 -128 256
WIRE -336 288 -336 256
FLAG 400 256 0
FLAG 48 256 0
FLAG -240 160 0
FLAG -336 16 V++
FLAG -336 288 V--
FLAG 96 224 V--
FLAG 448 240 V--
FLAG 96 128 V++
FLAG 448 144 V++
FLAG 560 192 Vout
FLAG -128 272 0
FLAG -128 160 V1
FLAG 240 176 V2
FLAG 368 176 V3
SYMBOL res 16 144 R90
WINDOW 0 0 56 VBottom 2
WINDOW 3 32 56 VTop 2
SYMATTR InstName R1
SYMATTR Value 10
SYMBOL res 144 16 R90
WINDOW 0 0 56 VBottom 2
WINDOW 3 32 56 VTop 2
SYMATTR InstName R2
SYMATTR Value 3.3
SYMBOL res 496 32 R90
WINDOW 0 0 56 VBottom 2
WINDOW 3 32 56 VTop 2
SYMATTR InstName R4
SYMATTR Value 10
SYMBOL res 368 160 R90
WINDOW 0 0 56 VBottom 2
WINDOW 3 32 56 VTop 2
SYMATTR InstName R3
SYMATTR Value 10
SYMBOL battery -400 96 R0
SYMATTR InstName V1
SYMBOL res -288 32 R0
SYMATTR InstName R5
SYMATTR Value 10
SYMBOL res -288 160 R0
SYMATTR InstName R6
SYMATTR Value 10
SYMBOL voltage -128 160 R0
SYMATTR InstName Vin
SYMATTR Value 10
SYMBOL OpAmps\\OP1177 96 112 R0
SYMATTR InstName U1
SYMBOL OpAmps\\OP1177 448 128 R0
SYMATTR InstName U2
TEXT 216 -40 Left 2 !.tran 0 100 1 0.1
