%YAML 1.1
%TAG !u! tag:unity3d.com,2011:
--- !u!114 &11400000
MonoBehaviour:
  m_ObjectHideFlags: 0
  m_CorrespondingSourceObject: {fileID: 0}
  m_PrefabInstance: {fileID: 0}
  m_PrefabAsset: {fileID: 0}
  m_GameObject: {fileID: 0}
  m_Enabled: 1
  m_EditorHideFlags: 0
  m_Script: {fileID: 11500000, guid: 8fb7e5639c338ff4a9a1cee8f5178231, type: 3}
  m_Name: ViewSystemSettings
  m_EditorClassIdentifier: 
  sourceName: GameViewSystemSettings
  isActive: 1
  uiViewsDefaultFolders:
  - Assets/GameContent/JigsawPuzzle/Prefabs/UiViews
  - Assets/GameContent/Lobby/UiViews
  viewsAssetsSources: []
  uiViewsSkinFolders: []
  uiViews:
  - AssetGUID: 22d8b230467dffa45b9f84697ffbf91d
    View:
      m_AssetGUID: 22d8b230467dffa45b9f84697ffbf91d
      m_SubObjectName: 
      m_SubObjectType: 
      m_EditorAssetChanged: 0
    ViewName: ButtonView
    Tag: 
    Type:
      fullTypeName: Game.Code.JigsawPuzzle.Views.GameplayViews.ButtonView, game.jiggsaw.views.runtime,
        Version=0.0.0.0, Culture=neutral, PublicKeyToken=null
    ModelType:
      fullTypeName: Game.Code.JigsawPuzzle.ViewModels.IButtonViewModel, game.jiggsaw.viewmodels.runtime,
        Version=0.0.0.0, Culture=neutral, PublicKeyToken=null
    ViewModelType:
      fullTypeName: Game.Code.JigsawPuzzle.ViewModels.ButtonViewModel, game.jiggsaw.viewmodels.runtime,
        Version=0.0.0.0, Culture=neutral, PublicKeyToken=null
    PoolingPreloadCount: 1
    Atlases: []
  - AssetGUID: 191717bfc3786e8469f221f52328e1c6
    View:
      m_AssetGUID: 191717bfc3786e8469f221f52328e1c6
      m_SubObjectName: 
      m_SubObjectType: 
      m_EditorAssetChanged: 0
    ViewName: GameAreaPanelView
    Tag: 
    Type:
      fullTypeName: Game.Code.JigsawPuzzle.Views.GameplayViews.PuzzleGameAreaView,
        game.jiggsaw.views.runtime, Version=0.0.0.0, Culture=neutral, PublicKeyToken=null
    ModelType:
      fullTypeName: Game.Code.JigsawPuzzle.ViewModels.IGameAreaViewModel, game.jiggsaw.viewmodels.runtime,
        Version=0.0.0.0, Culture=neutral, PublicKeyToken=null
    ViewModelType:
      fullTypeName: Game.Code.JigsawPuzzle.ViewModels.GameAreaViewModel, game.jiggsaw.viewmodels.runtime,
        Version=0.0.0.0, Culture=neutral, PublicKeyToken=null
    PoolingPreloadCount: 1
    Atlases: []
  - AssetGUID: 58e12f68dbccfc64e8522b2fae884abf
    View:
      m_AssetGUID: 58e12f68dbccfc64e8522b2fae884abf
      m_SubObjectName: 
      m_SubObjectType: 
      m_EditorAssetChanged: 0
    ViewName: JigsawButtonPanelView
    Tag: 
    Type:
      fullTypeName: Game.Code.JigsawPuzzle.Views.GameplayViews.JigsawButtonsPanelView,
        game.jiggsaw.views.runtime, Version=0.0.0.0, Culture=neutral, PublicKeyToken=null
    ModelType:
      fullTypeName: Game.Code.JigsawPuzzle.ViewModels.IJigsawButtonsPanelViewModel,
        game.jiggsaw.viewmodels.runtime, Version=0.0.0.0, Culture=neutral, PublicKeyToken=null
    ViewModelType:
      fullTypeName: Game.Code.JigsawPuzzle.ViewModels.JigsawButtonPanelViewModel,
        game.jiggsaw.viewmodels.runtime, Version=0.0.0.0, Culture=neutral, PublicKeyToken=null
    PoolingPreloadCount: 1
    Atlases: []
  - AssetGUID: 890266239505bf349b8c6ed19b564012
    View:
      m_AssetGUID: 890266239505bf349b8c6ed19b564012
      m_SubObjectName: 
      m_SubObjectType: 
      m_EditorAssetChanged: 0
    ViewName: JigsawGameplayAreaView
    Tag: 
    Type:
      fullTypeName: Game.Code.JigsawPuzzle.Views.GameplayViews.JigsawGameplayView,
        game.jiggsaw.views.runtime, Version=0.0.0.0, Culture=neutral, PublicKeyToken=null
    ModelType:
      fullTypeName: Game.Code.JigsawPuzzle.ViewModels.JigsawGameplayAreaViewModel,
        game.jiggsaw.viewmodels.runtime, Version=0.0.0.0, Culture=neutral, PublicKeyToken=null
    ViewModelType:
      fullTypeName: Game.Code.JigsawPuzzle.ViewModels.JigsawGameplayAreaViewModel,
        game.jiggsaw.viewmodels.runtime, Version=0.0.0.0, Culture=neutral, PublicKeyToken=null
    PoolingPreloadCount: 1
    Atlases: []
  - AssetGUID: 3ea4821168a063d44be269e901b866f1
    View:
      m_AssetGUID: 3ea4821168a063d44be269e901b866f1
      m_SubObjectName: 
      m_SubObjectType: 
      m_EditorAssetChanged: 0
    ViewName: JigsawGameplayScreenView
    Tag: 
    Type:
      fullTypeName: Game.Code.JigsawPuzzle.Views.GameplayViews.JigsawGameplayScreenView,
        game.jiggsaw.views.runtime, Version=0.0.0.0, Culture=neutral, PublicKeyToken=null
    ModelType:
      fullTypeName: Game.Code.JigsawPuzzle.ViewModels.JigsawGameplayViewModel, game.jiggsaw.viewmodels.runtime,
        Version=0.0.0.0, Culture=neutral, PublicKeyToken=null
    ViewModelType:
      fullTypeName: Game.Code.JigsawPuzzle.ViewModels.JigsawGameplayViewModel, game.jiggsaw.viewmodels.runtime,
        Version=0.0.0.0, Culture=neutral, PublicKeyToken=null
    PoolingPreloadCount: 1
    Atlases: []
  - AssetGUID: 405256e8875278344b9d7a6c8340b293
    View:
      m_AssetGUID: 405256e8875278344b9d7a6c8340b293
      m_SubObjectName: 
      m_SubObjectType: 
      m_EditorAssetChanged: 0
    ViewName: StatusInfo
    Tag: 
    Type:
      fullTypeName: Game.Code.JigsawPuzzle.Views.GameplayViews.PuzzleStatusView,
        game.jiggsaw.views.runtime, Version=0.0.0.0, Culture=neutral, PublicKeyToken=null
    ModelType:
      fullTypeName: Game.Code.JigsawPuzzle.Views.GameplayViews.IPuzzleStatusViewModel,
        game.jiggsaw.viewmodels.runtime, Version=0.0.0.0, Culture=neutral, PublicKeyToken=null
    ViewModelType:
      fullTypeName: Game.Code.JigsawPuzzle.ViewModels.LevelProgressViewModel, game.jiggsaw.viewmodels.runtime,
        Version=0.0.0.0, Culture=neutral, PublicKeyToken=null
    PoolingPreloadCount: 1
    Atlases: []
  - AssetGUID: ae0d6b162b2e47248b31f1c1ed43b7af
    View:
      m_AssetGUID: ae0d6b162b2e47248b31f1c1ed43b7af
      m_SubObjectName: 
      m_SubObjectType: 
      m_EditorAssetChanged: 0
    ViewName: ToggleButtonView
    Tag: 
    Type:
      fullTypeName: Game.Code.JigsawPuzzle.Views.GameplayViews.ToggleButtonView,
        game.jiggsaw.views.runtime, Version=0.0.0.0, Culture=neutral, PublicKeyToken=null
    ModelType:
      fullTypeName: Game.Code.JigsawPuzzle.ViewModels.IToggleButtonViewModel, game.jiggsaw.viewmodels.runtime,
        Version=0.0.0.0, Culture=neutral, PublicKeyToken=null
    ViewModelType:
      fullTypeName: Game.Code.JigsawPuzzle.ViewModels.BackgroundToggleViewModel,
        game.jiggsaw.viewmodels.runtime, Version=0.0.0.0, Culture=neutral, PublicKeyToken=null
    PoolingPreloadCount: 1
    Atlases: []
  - AssetGUID: f17b89ff680711d499667b6d6a0b1dcb
    View:
      m_AssetGUID: f17b89ff680711d499667b6d6a0b1dcb
      m_SubObjectName: 
      m_SubObjectType: 
      m_EditorAssetChanged: 0
    ViewName: ScrollPuzzlePanelView
    Tag: 
    Type:
      fullTypeName: Game.Code.JigsawPuzzle.Views.PuzzleScrollViews.PuzzleItemsScrollView,
        game.jiggsaw.views.runtime, Version=0.0.0.0, Culture=neutral, PublicKeyToken=null
    ModelType:
      fullTypeName: Game.Code.JigsawPuzzle.ViewModels.JigsawItemsScrollViewModel,
        game.jiggsaw.viewmodels.runtime, Version=0.0.0.0, Culture=neutral, PublicKeyToken=null
    ViewModelType:
      fullTypeName: Game.Code.JigsawPuzzle.ViewModels.JigsawItemsScrollViewModel,
        game.jiggsaw.viewmodels.runtime, Version=0.0.0.0, Culture=neutral, PublicKeyToken=null
    PoolingPreloadCount: 1
    Atlases: []
  - AssetGUID: cab1b0488801a7342ac92fb3329ba05b
    View:
      m_AssetGUID: cab1b0488801a7342ac92fb3329ba05b
      m_SubObjectName: 
      m_SubObjectType: 
      m_EditorAssetChanged: 0
    ViewName: LevelStartView
    Tag: 
    Type:
      fullTypeName: Game.Code.Lobby.Views.LevelStartView, game.lobby.views, Version=0.0.0.0,
        Culture=neutral, PublicKeyToken=null
    ModelType:
      fullTypeName: Game.Code.Lobby.Models.ILevelStartViewModel, game.lobby.viewmodels,
        Version=0.0.0.0, Culture=neutral, PublicKeyToken=null
    ViewModelType:
      fullTypeName: Game.Code.Lobby.Models.LevelStartViewModel, game.lobby.viewmodels,
        Version=0.0.0.0, Culture=neutral, PublicKeyToken=null
    PoolingPreloadCount: 1
    Atlases: []
  applyAddressablesGroup: 0
  labels: []
  addressableGroupName: 
  sources: []
  layoutFlow: {fileID: 11400000, guid: c22cfe04dc8dc9e43b8b9b36576fab63, type: 2}
  viewModelResolvers:
    modelFactoryTimeoutMs: 500
    modelResolvers: []
  references:
    version: 2
    RefIds: []
