%YAML 1.1
%TAG !u! tag:unity3d.com,2011:
--- !u!114 &11400000
MonoBehaviour:
  m_ObjectHideFlags: 0
  m_CorrespondingSourceObject: {fileID: 0}
  m_PrefabInstance: {fileID: 0}
  m_PrefabAsset: {fileID: 0}
  m_GameObject: {fileID: 0}
  m_Enabled: 1
  m_EditorHideFlags: 0
  m_Script: {fileID: 11500000, guid: a08e2999184268444976b62b1b857dc8, type: 3}
  m_Name: ScriptableProcessorsControllerAsset
  m_EditorClassIdentifier: 
  processors:
  - {fileID: 11400000, guid: bfe764b4a0900914abc161a728a2672b, type: 2}
  - {fileID: 11400000, guid: 71e77e154b8ccf342b682dae99479d0a, type: 2}
  activateOnLoad: 1
