%YAML 1.1
%TAG !u! tag:unity3d.com,2011:
--- !u!114 &11400000
MonoBehaviour:
  m_ObjectHideFlags: 0
  m_CorrespondingSourceObject: {fileID: 0}
  m_PrefabInstance: {fileID: 0}
  m_PrefabAsset: {fileID: 0}
  m_GameObject: {fileID: 0}
  m_Enabled: 1
  m_EditorHideFlags: 0
  m_Script: {fileID: 11500000, guid: 4fc7fc4d0bb747fa904d2b13d40e6daa, type: 3}
  m_Name: LevelServiceSettingsAsset
  m_EditorClassIdentifier: 
  alwaysCreateNewValue: 0
  defaultValue:
    difficultyPresets:
      difficultyPresets:
      - columns: 6
        rows: 4
        duration: 5
      - columns: 8
        rows: 8
        duration: 10
      - columns: 12
        rows: 12
        duration: 15
    defaultLevel: {fileID: 11400000, guid: 91c12d52b45c6a74995c61fe529b1c44, type: 2}
    defaultPreset:
      columns: 3
      rows: 3
      duration: 2
    levels:
    - {fileID: 11400000, guid: 91c12d52b45c6a74995c61fe529b1c44, type: 2}
