{
    "name": "com.unigame.viewnodes",
    "rootNamespace": "",
    "references": [
        "GUID:8e4577c9194c10845984cf27eb974fd1",
        "GUID:44c5a9fbe6286bb4da5426e7a847a8d3",
        "GUID:a0b431bd9232ee0439a3722ec36414ed",
        "GUID:7aa076d38fb14aa448159faea36ca289",
        "GUID:9f8e6b2872ac2ca4683e584b9ba21f29",
        "GUID:6632c725b5599b14c865359e6ecc36f4",
        "GUID:94b76ab488496fe4ba2e594d6c583770",
        "GUID:560b04d1a97f54a4e82edc0cbbb69285",
        "GUID:f51ebe6a0ceec4240a699833d6309b23",
        "GUID:9e24947de15b9834991c9d8411ea37cf"
    ],
    "includePlatforms": [],
    "excludePlatforms": [],
    "allowUnsafeCode": false,
    "overrideReferences": false,
    "precompiledReferences": [],
    "autoReferenced": true,
    "defineConstraints": [],
    "versionDefines": [],
    "noEngineReferences": false
}