{
  "context": "riddhi, welcome to WildDuck email service!\\n\\nIf you are seeing this message then it means you have reached the inbox of your new email address riddhi.gajera@test.keysupre.me. Be aware though that the service is in a constant change, so this address might disappear during the next database schema update. Don't start using it as your main email address!\\n\\nThis message was generated and inserted to this mailbox from the /emails folder using the default template.\\n\\nYour friends from the WildDuck team\\n\\n\u2013 Check out WildDuck on Github: https://github.com/nodemailer/wildduck",
  "errors": [
    {
      "actualword": "inbox",
      "category": [
        "Spelling"
      ],
      "replacements": [
        "in box"
      ],
      "type": [
        "misspelling"
      ]
    },
    {
      "actualword": "nIf",
      "category": [
        "Spelling"
      ],
      "replacements": [
        "nigh",
        "if",
        "night",
        "NSF",
        "nil",
        "nip",
        "RIF",
        "nit",
        "nix",
        "naif",
        "Enif",
        "NF",
        "NIH",
        "Ni",
        "nib",
        "niff"
      ],
      "type": [
        "misspelling"
      ]
    },
    {
      "actualword": "nThis",
      "category": [
        "Spelling"
      ],
      "replacements": [
        "this"
      ],
      "type": [
        "misspelling"
      ]
    },
    {
      "actualword": "nYour",
      "category": [
        "Spelling"
      ],
      "replacements": [
        "your"
      ],
      "type": [
        "misspelling"
      ]
    },
    {
      "actualword": "riddhi",
      "category": [
        "Grammer",
        "Spelling"
      ],
      "replacements": [
        "Riddhi",
        "ridden",
        "riddle",
        "Riddle",
        "Sindhi"
      ],
      "type": [
        "typographical",
        "misspelling"
      ]
    }
  ]
}