{
	"type": "/runtime",
	"runtime": "reels",
	"children": [
		{
		"type": "/guide",
		"x": -130,
		"y": -80,
		"children": [
			{
				"type": "guides/reel",
				"x": 0
			},
			{
				"type": "guides/reel",
				"x": 52
			},
			{
				"type": "guides/reel",
				"x": 104
			},
			{
				"type": "guides/reel",
				"x": 156
			},
			{
				"type": "guides/reel",
				"x": 208
			}
		  ]
		}
	]
}
