{
    "version": "1.0.0",
    "name": "LiveStreamHelperPlugin.name",
    "description": "LiveStreamHelperPlugin.description",
    "authors": [
        {
            "name": "Blesta",
            "url": "http://www.blesta.com/ "
        }
    ]
}