﻿{
  "profiles": {
    "Otus.Teaching.PromocodeFactory.WebHost": {
      "commandName": "Project",
      "launchUrl": "swagger/index.html",
      "launchBrowser": true,
      "applicationUrl": "https://localhost:8093;http://localhost:8094",
      "environmentVariables": {
        "ASPNETCORE_ENVIRONMENT": "Development"
      }
    }
  }
}
