[{
  "_id": {
    "$oid": "659eb78bb25447dd95c31894"
  },
  "Delete": false,
  "Email": true,
  "EntityId": {
    "$binary": {
      "base64": "bDvOpGWzJESU874QFegXmQ==",
      "subType": "03"
    }
  },
  "SMS": true,
  "Telegram": true
},
{
  "_id": {
    "$oid": "659eb794b25447dd95c31895"
  },
  "Delete": false,
  "Email": true,
  "EntityId": {
    "$binary": {
      "base64": "q5DX76b8jEuXYnEEZEgZUg==",
      "subType": "03"
    }
  },
  "SMS": false,
  "Telegram": true
},
{
  "_id": {
    "$oid": "659eb798b25447dd95c31896"
  },
  "Delete": false,
  "Email": false,
  "EntityId": {
    "$binary": {
      "base64": "2H2NUBKeJEa9ioYsEyfLxg==",
      "subType": "03"
    }
  },
  "SMS": false,
  "Telegram": true
}]