<svg width="295" height="160" viewBox="0 0 295 160" fill="none" xmlns="http://www.w3.org/2000/svg">
<g filter="url(#filter0_b_377_1454)">
<path d="M118.875 62L63.375 87.75L6.79004 108V160H282.769C285.658 160 288 157.657 288 154.768V35.5L232.25 28.25L176.125 20.75L118.875 62Z" fill="url(#paint0_linear_377_1454)"/>
</g>
<g filter="url(#filter1_f_377_1454)">
<circle cx="1.74397" cy="1.74397" r="1.74397" transform="matrix(-1 0 0 1 8.53418 93.1289)" fill="white"/>
<circle cx="1.74397" cy="1.74397" r="1.74397" transform="matrix(-1 0 0 1 8.53418 93.1289)" stroke="white" stroke-width="1.22078" stroke-linecap="round" stroke-linejoin="round"/>
</g>
<g filter="url(#filter2_f_377_1454)">
<circle cx="1.74397" cy="1.74397" r="1.74397" transform="matrix(-1 0 0 1 289.619 20.7539)" fill="white"/>
<circle cx="1.74397" cy="1.74397" r="1.74397" transform="matrix(-1 0 0 1 289.619 20.7539)" stroke="white" stroke-width="1.22078" stroke-linecap="round" stroke-linejoin="round"/>
</g>
<g filter="url(#filter3_f_377_1454)">
<path d="M287.875 21.3379L231.5 14.9629L175.375 6.83789L118.5 47.8379L63.25 73.8379L6.875 94.8379" stroke="white" stroke-width="1.22078" stroke-linecap="round" stroke-linejoin="round"/>
</g>
<path d="M287.875 15.125L231.5 8.75L175.375 0.625L118.5 41.625L63.25 67.625L6.875 88.625" stroke="white" stroke-width="1.22078" stroke-linecap="round" stroke-linejoin="round"/>
<circle cx="2.61595" cy="2.61595" r="2.61595" transform="matrix(-1 0 0 1 9.40527 85.7305)" fill="white"/>
<circle cx="2.61595" cy="2.61595" r="2.61595" transform="matrix(-1 0 0 1 290.491 12.7686)" fill="white"/>
<defs>
<filter id="filter0_b_377_1454" x="4.77705" y="18.737" width="285.236" height="143.276" filterUnits="userSpaceOnUse" color-interpolation-filters="sRGB">
<feFlood flood-opacity="0" result="BackgroundImageFix"/>
<feGaussianBlur in="BackgroundImageFix" stdDeviation="1.00649"/>
<feComposite in2="SourceAlpha" operator="in" result="effect1_backgroundBlur_377_1454"/>
<feBlend mode="normal" in="SourceGraphic" in2="effect1_backgroundBlur_377_1454" result="shape"/>
</filter>
<filter id="filter1_f_377_1454" x="0.409578" y="88.4926" width="12.7609" height="12.7609" filterUnits="userSpaceOnUse" color-interpolation-filters="sRGB">
<feFlood flood-opacity="0" result="BackgroundImageFix"/>
<feBlend mode="normal" in="SourceGraphic" in2="BackgroundImageFix" result="shape"/>
<feGaussianBlur stdDeviation="2.01298" result="effect1_foregroundBlur_377_1454"/>
</filter>
<filter id="filter2_f_377_1454" x="281.495" y="16.1176" width="12.7609" height="12.7609" filterUnits="userSpaceOnUse" color-interpolation-filters="sRGB">
<feFlood flood-opacity="0" result="BackgroundImageFix"/>
<feBlend mode="normal" in="SourceGraphic" in2="BackgroundImageFix" result="shape"/>
<feGaussianBlur stdDeviation="2.01298" result="effect1_foregroundBlur_377_1454"/>
</filter>
<filter id="filter3_f_377_1454" x="2.23868" y="2.20157" width="290.273" height="97.2726" filterUnits="userSpaceOnUse" color-interpolation-filters="sRGB">
<feFlood flood-opacity="0" result="BackgroundImageFix"/>
<feBlend mode="normal" in="SourceGraphic" in2="BackgroundImageFix" result="shape"/>
<feGaussianBlur stdDeviation="2.01298" result="effect1_foregroundBlur_377_1454"/>
</filter>
<linearGradient id="paint0_linear_377_1454" x1="288.001" y1="158.462" x2="197.733" y2="-2.74613" gradientUnits="userSpaceOnUse">
<stop stop-color="#FCFCFC"/>
<stop offset="1" stop-color="white" stop-opacity="0"/>
</linearGradient>
</defs>
</svg>
