<svg width="293" height="151" viewBox="0 0 293 151" fill="none" xmlns="http://www.w3.org/2000/svg">
<g filter="url(#filter0_b_377_1321)">
<path d="M117.907 116.5L63.38 133.5L5.79004 143.494V151H281.769C284.658 151 287 148.657 287 145.768V24L230.023 50.5L174.884 56.75L117.907 116.5Z" fill="url(#paint0_linear_377_1321)"/>
</g>
<g filter="url(#filter1_f_377_1321)">
<path d="M286.25 11L229.5 37.75L174.25 43.75L117 102.75L62.5909 120.116L5.00098 130.334" stroke="white" stroke-width="1.22078" stroke-linecap="round" stroke-linejoin="round"/>
</g>
<g filter="url(#filter2_f_377_1321)">
<circle cx="1.74397" cy="1.74397" r="1.74397" transform="matrix(-1 0 0 1 288.09 9.00879)" fill="white"/>
<circle cx="1.74397" cy="1.74397" r="1.74397" transform="matrix(-1 0 0 1 288.09 9.00879)" stroke="white" stroke-width="1.22078" stroke-linecap="round" stroke-linejoin="round"/>
</g>
<g filter="url(#filter3_f_377_1321)">
<circle cx="1.74397" cy="1.74397" r="1.74397" transform="matrix(-1 0 0 1 8.18262 128.11)" fill="white"/>
<circle cx="1.74397" cy="1.74397" r="1.74397" transform="matrix(-1 0 0 1 8.18262 128.11)" stroke="white" stroke-width="1.22078" stroke-linecap="round" stroke-linejoin="round"/>
</g>
<path d="M286.211 3.82812L229.234 31.25L174.095 37.5L117.118 96L62.5909 113.403L5.00098 123.621" stroke="white" stroke-width="1.22078" stroke-linecap="round" stroke-linejoin="round"/>
<circle cx="2.61595" cy="2.61595" r="2.61595" transform="matrix(-1 0 0 1 288.962 0.99707)" fill="white"/>
<circle cx="2.61595" cy="2.61595" r="2.61595" transform="matrix(-1 0 0 1 8.83691 120.48)" fill="white"/>
<defs>
<filter id="filter0_b_377_1321" x="3.77705" y="21.987" width="285.236" height="131.026" filterUnits="userSpaceOnUse" color-interpolation-filters="sRGB">
<feFlood flood-opacity="0" result="BackgroundImageFix"/>
<feGaussianBlur in="BackgroundImageFix" stdDeviation="1.00649"/>
<feComposite in2="SourceAlpha" operator="in" result="effect1_backgroundBlur_377_1321"/>
<feBlend mode="normal" in="SourceGraphic" in2="effect1_backgroundBlur_377_1321" result="shape"/>
</filter>
<filter id="filter1_f_377_1321" x="0.364656" y="6.36368" width="290.522" height="128.607" filterUnits="userSpaceOnUse" color-interpolation-filters="sRGB">
<feFlood flood-opacity="0" result="BackgroundImageFix"/>
<feBlend mode="normal" in="SourceGraphic" in2="BackgroundImageFix" result="shape"/>
<feGaussianBlur stdDeviation="2.01298" result="effect1_foregroundBlur_377_1321"/>
</filter>
<filter id="filter2_f_377_1321" x="279.965" y="4.37247" width="12.7609" height="12.7609" filterUnits="userSpaceOnUse" color-interpolation-filters="sRGB">
<feFlood flood-opacity="0" result="BackgroundImageFix"/>
<feBlend mode="normal" in="SourceGraphic" in2="BackgroundImageFix" result="shape"/>
<feGaussianBlur stdDeviation="2.01298" result="effect1_foregroundBlur_377_1321"/>
</filter>
<filter id="filter3_f_377_1321" x="0.0580158" y="123.474" width="12.7609" height="12.7609" filterUnits="userSpaceOnUse" color-interpolation-filters="sRGB">
<feFlood flood-opacity="0" result="BackgroundImageFix"/>
<feBlend mode="normal" in="SourceGraphic" in2="BackgroundImageFix" result="shape"/>
<feGaussianBlur stdDeviation="2.01298" result="effect1_foregroundBlur_377_1321"/>
</filter>
<linearGradient id="paint0_linear_377_1321" x1="287" y1="149.462" x2="196.733" y2="-11.7462" gradientUnits="userSpaceOnUse">
<stop stop-color="#FCFCFC"/>
<stop offset="1" stop-color="white" stop-opacity="0"/>
</linearGradient>
</defs>
</svg>
