<svg width="136" height="48" viewBox="0 0 136 48" fill="none" xmlns="http://www.w3.org/2000/svg">
<path d="M75.2607 3.86075C66.1498 2.68939 20.8893 33.4909 0 47.8615C1.18521 50.3802 55.1122 17.7869 58.2234 16.1572C62.6299 13.849 71.1912 8.62257 64.2975 21.4907C57.6307 33.9354 69.1865 28.4538 72.7422 26.5278C76.2978 24.6019 99.4093 13.3424 102.076 12.3054C104.743 11.2683 115.41 9.04607 105.039 22.9723C94.2417 37.4716 106.521 35.8613 111.854 34.8242C117.187 33.7872 122.817 31.8613 135.854 26.5278C134.817 25.3426 133.232 26.5278 120.002 29.3426C106.076 32.3057 114.373 30.2316 124.002 14.0831C133.632 -2.06535 114.123 0.23184 108.002 2.52737C99.6732 5.65098 87.8536 12.7498 76.4459 19.1203C64.4891 25.7975 71.1122 18.3254 73.6311 14.0832C76.4459 9.34233 79.7454 4.43732 75.2607 3.86075Z" fill="white"/>
</svg>
