{
  "job_id": 1234,
  "parameters": [
    {
      "id": "source_path",
      "type": "string",
      "store": "environment",
      "value": "SOURCE_PATH"
    },
    {
      "id": "destination_path",
      "type": "string",
      "store": "environment",
      "value": "DESTINATION_PATH"
    },
    {
      "id": "master_playlist",
      "type": "string",
      "value": "franceinfo"
    },
    {
      "id": "endpoint",
      "type": "string",
      "value": "https://test.eu-west-1.amazonaws.com"
    },
    {
      "id": "path",
      "type": "string",
      "value": "franceinfo"
    },
    {
      "id": "playlist",
      "type": "string",
      "value": "franceinfo"
    },
    {
      "id": "format",
      "type": "string",
      "value": "WebVtt"
    }
  ]
}
