{
    "job_id": 1234,
    "parameters": [
      {
        "id": "source_path",
        "type": "string",
        "value": "COLLATERAL.stl"
      },
      {
        "id": "destination_path",
        "type": "string",
        "value": "COLLATERAL_OK.stl"
      },
      {
        "id": "timecode",
        "type": "string",
        "value": "10:30:18:20"

      }

    ]
  }
  