{
  "job_id": 1234,
  "parameters": [
    {
      "id": "source_path",
      "type": "string",
      "value": "input.wav"
    },
    {
      "id": "destination_path",
      "type": "string",
      "value": "transcript.json"
    },
    {
      "id": "language",
      "type": "string",
      "value": "fr"
    },
    {
      "id": "output_format",
      "type": "string",
      "value": "json"
    },
    {
      "id": "model_path",
      "type": "string",
      "value": "/path/to/model"
    }
  ]
}
