{
    "job_id": 654,
    "parameters" : [
        {
            "id": "source_path",
            "type": "string",
            "store": "environment",
            "value": "SOURCE_PATH"
        },
        {
            "id": "destination_path",
            "type": "string",
            "store": "environment",
            "value": "DESTINATION_PATH"
        },
        {
            "id": "confidence",
            "type": "integer",
            "value": 80
        },
        {
            "id": "requirements",
            "type": "requirements",
            "value": {
                "path": []
            }
        },
        {
            "id": "batch_size",
            "type": "integer",
            "value": 1
        }
    ]
}