{
  "job_id": 999,
  "parameters": [
    {
      "id": "source_path",
      "type": "string",
      "value": "./test_batch_media_processor.mxf"
    },
    {
      "id": "destination_path",
      "type": "string",
      "value": "./test_batch_media_processor.json"
    },
    {
      "id": "batch_size",
      "type": "integer",
      "value": 2
    }
  ]
}