{
  "instance_id": "60eaecee-6a5e-4f6c-be05-3d0fe3291171",
  "queue_name": "job_adm_loudness",
  "direct_messaging_queue_name": "direct_messaging_60eaecee-6a5e-4f6c-be05-3d0fe3291171",
  "label": "ADM Engine Worker",
  "short_description": "Processes BW64/ADM audio file rendering.",
  "description": "This worker processes ADM rendering from specified BW64/ADM audio file.",
  "version": "1.0.0",
  "sdk_version": "1.1.0",
  "parameters": {
    "type": "object",
    "title": "CWorkerParameters",
    "$schema": "http://json-schema.org/draft-07/schema#",
    "properties": {
      "input": {
        "type": "string"
      },
      "output": {
        "type": [
          "string",
          "null"
        ]
      },
      "element_id": {
        "type": [
          "string",
          "null"
        ]
      },
      "gain_mapping": {
        "type": [
          "array",
          "null"
        ]
      }
    }
  }
}