{
  "created_at": "2022-04-05T10:35:08",
  "id": 1,
  "identifier": "sleeper",
  "label": "Sleeper",
  "is_live": false,
  "reference": "sleeper",
  "schema_version": "1.9",
  "status": {
    "id": 2,
    "inserted_at": "2022-04-05T10:35:08",
    "state": "error"
  },
  "version_major": 0,
  "version_minor": 18,
  "version_micro": 1,
  "start_parameters": [],
  "steps": [
    {
      "jobs": {
        "completed": 0,
        "errors": 1,
        "processing": 0,
        "queued": 0,
        "skipped": 0,
        "stopped": 0,
        "total": 1
      },
      "icon": "file_download",
      "id": 0,
      "label": "Sleeping",
      "name": "job_sleeper",
      "parameters": [
        {
          "id": "source_paths",
          "type": "array_of_strings",
          "value": ["/tmp"]
        },
        {
          "id": "action",
          "type": "string",
          "value": "completed"
        },
        {
          "id" : "sleep",
          "type": "integer",
          "value": 6000
        }
      ],
      "mode": "one_for_one",
      "skip_destination_path": false,
      "parent_ids": [],
      "required_to_start": []
    }
  ],
  "tags": ["sleeper"]
}
