<svg viewBox="0 0 391 239" fill="none" xmlns="http://www.w3.org/2000/svg">
  <defs>
    <clipPath id="clip">
      <ellipse cx="195.876" cy="119.592" rx="195.935" ry="117.09" transform="rotate(-7.40866 195.876 119.592)" />
    </clipPath>
  </defs>
</svg>
