{
	"displayName": "DHS Base Cooling Rate Fix v2",
	"version": "1.0",
	"buildNumber": 1,
	"description": "Corrects the base cooling rate for mechs with engine double heatsinks. This version is compatible with Kestrel Lancers DLC",
	"author": "ModdingIsTheGame",
	"authorURL": "",
	"defaultLoadOrder": 0,
	"gameVersion": "1.1.0",
	"manifest": [
		"/Game/DLC1/Objects/Mechs/Archer/MDA/ARC-AGC_MDA.uasset",
		"/Game/DLC1/Objects/Mechs/Archer/MDA/ARC-T_MDA.uasset",
		"/Game/DLC1/Objects/Mechs/Assassin/MDA/ASN-27_MDA.uasset",
		"/Game/DLC1/Objects/Mechs/Assassin/MDA/ASN-DD_MDA.uasset",
		"/Game/DLC1/Objects/Mechs/Blackknight/MDA/BL-6B-KNT_MDA.uasset",
		"/Game/DLC1/Objects/Mechs/Champion/MDA/CHP-1N2_MDA.uasset",
		"/Game/DLC1/Objects/Mechs/Champion/MDA/CHP-1NB_MDA.uasset",
		"/Game/DLC1/Objects/Mechs/Charger/MDA/CGR-3K_MDA.uasset",
		"/Game/DLC1/Objects/Mechs/Corsair/MDA/COR-PVT_MDA.uasset",
		"/Game/DLC1/Objects/Mechs/Cyclops/MDA/CP-11-P_MDA.uasset",
		"/Game/DLC1/Objects/Mechs/Dervish/MDA/DV-7D_MDA.uasset",
		"/Game/DLC1/Objects/Mechs/Dervish/MDA/DV-FR_MDA.uasset",
		"/Game/DLC1/Objects/Mechs/Dragon/MDA/DRG-SDW_MDA.uasset",
		"/Game/DLC1/Objects/Mechs/Enforcer/MDA/ENF-GH_MDA.uasset",
		"/Game/DLC1/Objects/Mechs/Griffin/MDA/GRF-2N_MDA.uasset",
		"/Game/DLC1/Objects/Mechs/Kingcrab/MDA/KGC-CAR_MDA.uasset",
		"/Game/DLC1/Objects/Mechs/Locust/MDA/LCT-PB_MDA.uasset",
		"/Game/DLC1/Objects/Mechs/Orion/MDA/ON1-YAJ_MDA.uasset",
		"/Game/DLC1/Objects/Mechs/Phoenixhawk/MDA/PXH-1B_MDA.uasset",
		"/Game/DLC1/Objects/Mechs/Phoenixhawk/MDA/PXH-3S_MDA.uasset",
		"/Game/DLC1/Objects/Mechs/Stalker/MDA/STK-3FB_MDA.uasset",
		"/Game/DLC1/Objects/Mechs/Trebuchet/MDA/TBT-LG_MDA.uasset",
		"/Game/DLC1/Objects/Mechs/Victor/MDA/VTR-BSK_MDA.uasset",
		"/Game/DLC1/Objects/Mechs/Wolfhound/MDA/WLF-GR_MDA.uasset",
		"/Game/DLC1/Objects/Mechs/Zeus/MDA/ZEU-SK_MDA.uasset",
		"/Game/DLC2/Objects/Mechs/Archer/MDA/ARC-2RB_MDA.uasset",
		"/Game/DLC2/Objects/Mechs/Kintaro/MDA/KTO-19b_MDA.uasset",
		"/Game/DLC2/Objects/Mechs/Marauder/MDA/MAD-2R_MDA.uasset",
		"/Game/DLC2/Objects/Mechs/Thunderbolt/MDA/TDR-5SD_MDA.uasset",
		"/Game/DLC2/Objects/Mechs/Warhammer/MDA/WHM-6RB_MDA.uasset",
		"/Game/Objects/Mechs/Annihilator/MDA/ANH-1X_MDA.uasset",
		"/Game/Objects/Mechs/Assassin/MDA/ASN-26_MDA.uasset",
		"/Game/Objects/Mechs/Awesome/MDA/AWS-9M_MDA.uasset",
		"/Game/Objects/Mechs/Awesome/MDA/AWS-PB_MDA.uasset",
		"/Game/Objects/Mechs/Banshee/MDA/BNC-LM_MDA.uasset",
		"/Game/Objects/Mechs/Banshee/MDA/BNC-SR_MDA.uasset",
		"/Game/Objects/Mechs/Battlemaster/MDA/BLR-1GHE_MDA.uasset",
		"/Game/Objects/Mechs/Battlemaster/MDA/BLR-3M_MDA.uasset",
		"/Game/Objects/Mechs/Blackjack/MDA/BJ-3_MDA.uasset",
		"/Game/Objects/Mechs/Blackjack/MDA/BJ-A_MDA.uasset",
		"/Game/Objects/Mechs/Blackknight/MDA/BL-P-KNT_MDA.uasset",
		"/Game/Objects/Mechs/Catapult/MDA/CPLT-J_MDA.uasset",
		"/Game/Objects/Mechs/Cicada/MDA/CDA-3M_MDA.uasset",
		"/Game/Objects/Mechs/Cicada/MDA/CDA-X5_MDA.uasset",
		"/Game/Objects/Mechs/Commando/MDA/COM-TDK_MDA.uasset",
		"/Game/Objects/Mechs/Crab/MDA/CRB-27B_MDA.uasset",
		"/Game/Objects/Mechs/Crab/MDA/CRB-27SL_MDA.uasset",
		"/Game/Objects/Mechs/Crab/MDA/CRB-FL_MDA.uasset",
		"/Game/Objects/Mechs/Cyclops/MDA/CP-S_MDA.uasset",
		"/Game/Objects/Mechs/Enforcer/MDA/ENF-4P_MDA.uasset",
		"/Game/Objects/Mechs/Enforcer/MDA/ENF-5P_MDA.uasset",
		"/Game/Objects/Mechs/Firestarter/MDA/FS9-E_MDA.uasset",
		"/Game/Objects/Mechs/Grasshopper/MDA/GHR-5P_MDA.uasset",
		"/Game/Objects/Mechs/Grasshopper/MDA/GHR-MJ_MDA.uasset",
		"/Game/Objects/Mechs/Griffin/MDA/GRF-3M_MDA.uasset",
		"/Game/Objects/Mechs/Highlander/MDA/HGN-732B_MDA.uasset",
		"/Game/Objects/Mechs/Highlander/MDA/HGN-HM_MDA.uasset",
		"/Game/Objects/Mechs/Hunchback/MDA/HBK-GI_MDA.uasset",
		"/Game/Objects/Mechs/Jagermech/MDA/JM6-FB_MDA.uasset",
		"/Game/Objects/Mechs/Javelin/MDA/JVN-HT_MDA.uasset",
		"/Game/Objects/Mechs/Jenner/MDA/JR7-O_MDA.uasset",
		"/Game/Objects/Mechs/Kingcrab/MDA/KGC-000B_MDA.uasset",
		"/Game/Objects/Mechs/Kingcrab/MDA/KGC-KJ_MDA.uasset",
		"/Game/Objects/Mechs/Kintaro/MDA/KTO-20_MDA.uasset",
		"/Game/Objects/Mechs/Kintaro/MDA/KTO-GB_MDA.uasset",
		"/Game/Objects/Mechs/Marauder/MDA/MAD-5D_MDA.uasset",
		"/Game/Objects/Mechs/Marauder/MDA/MAD-BH2_MDA.uasset",
		"/Game/Objects/Mechs/Mauler/MDA/MAL-1P_MDA.uasset",
		"/Game/Objects/Mechs/Mauler/MDA/MAL-1R_MDA.uasset",
		"/Game/Objects/Mechs/Mauler/MDA/MAL-2P_MDA.uasset",
		"/Game/Objects/Mechs/Mauler/MDA/MAL-KO_MDA.uasset",
		"/Game/Objects/Mechs/Nightstar/MDA/NSR-9J_MDA.uasset",
		"/Game/Objects/Mechs/Orion/MDA/ON1-M_MDA.uasset",
		"/Game/Objects/Mechs/Orion/MDA/ON1-P_MDA.uasset",
		"/Game/Objects/Mechs/Panther/MDA/PNT-10P_MDA.uasset",
		"/Game/Objects/Mechs/Panther/MDA/PNT-KK_MDA.uasset",
		"/Game/Objects/Mechs/Phoenixhawk/MDA/PXH-KK_MDA.uasset",
		"/Game/Objects/Mechs/Quickdraw/MDA/QKD-5K_MDA.uasset",
		"/Game/Objects/Mechs/Quickdraw/MDA/QKD-IV4_MDA.uasset",
		"/Game/Objects/Mechs/Raven/MDA/RVN-H_MDA.uasset",
		"/Game/Objects/Mechs/Rifleman/MDA/RFL-LK_MDA.uasset",
		"/Game/Objects/Mechs/Shadowhawk/MDA/SHD-5M_MDA.uasset",
		"/Game/Objects/Mechs/Shadowhawk/MDA/SHD-GD_MDA.uasset",
		"/Game/Objects/Mechs/Spider/MDA/SDR-A_MDA.uasset",
		"/Game/Objects/Mechs/Thunderbolt/MDA/TDR-9SE_MDA.uasset",
		"/Game/Objects/Mechs/Trebuchet/MDA/TBT-3C_MDA.uasset",
		"/Game/Objects/Mechs/Trebuchet/MDA/TBT-7M_MDA.uasset",
		"/Game/Objects/Mechs/Urbanmech/MDA/UM-K9_MDA.uasset",
		"/Game/Objects/Mechs/Victor/MDA/VTR-DS_MDA.uasset",
		"/Game/Objects/Mechs/Warhammer/MDA/WHM-BW_MDA.uasset",
		"/Game/Objects/Mechs/Wolverine/MDA/WVR-7H_MDA.uasset",
		"/Game/Objects/Mechs/Wolverine/MDA/WVR-Q_MDA.uasset",
		"/Game/Objects/Mechs/Zeus/MDA/ZEU-5S_MDA.uasset",
		"/Game/Objects/Mechs/Zeus/MDA/ZEU-9S_MDA.uasset"
	],
	"steamPublishedFileId": 0,
	"steamLastSubmittedBuildNumber": 0,
	"steamModVisibility": "Private"
}