-- Merging decision tree log ---
manifest
ADDED from D:\Informatique de gestion\Session ete 2018\Programmation mobile 2\ProjetFitness\app\src\main\AndroidManifest.xml:2:1-78:12
INJECTED from D:\Informatique de gestion\Session ete 2018\Programmation mobile 2\ProjetFitness\app\src\main\AndroidManifest.xml:2:1-78:12
INJECTED from D:\Informatique de gestion\Session ete 2018\Programmation mobile 2\ProjetFitness\app\src\main\AndroidManifest.xml:2:1-78:12
INJECTED from D:\Informatique de gestion\Session ete 2018\Programmation mobile 2\ProjetFitness\app\src\main\AndroidManifest.xml:2:1-78:12
MERGED from [com.android.support:design:25.3.1] C:\Users\Janah\.gradle\caches\transforms-1\files-1.1\design-25.3.1.aar\0e2070721a9a891b7a7330fb9fca55d5\AndroidManifest.xml:17:1-31:12
MERGED from [com.firebaseui:firebase-ui-database:0.4.0] C:\Users\Janah\.gradle\caches\transforms-1\files-1.1\firebase-ui-database-0.4.0.aar\2cfc8800410f77c747a6c5e4f8b8add4\AndroidManifest.xml:2:1-13:12
MERGED from [com.yalantis:ucrop:2.2.0] C:\Users\Janah\.gradle\caches\transforms-1\files-1.1\ucrop-2.2.0.aar\9cb82cd90faaf3bd40496806861d5d9a\AndroidManifest.xml:2:1-12:12
MERGED from [com.android.support:appcompat-v7:25.3.1] C:\Users\Janah\.gradle\caches\transforms-1\files-1.1\appcompat-v7-25.3.1.aar\20ab1132e95f01ccb9793ac7d0fe9445\AndroidManifest.xml:17:1-31:12
MERGED from [com.android.support.constraint:constraint-layout:1.0.0-alpha9] C:\Users\Janah\.gradle\caches\transforms-1\files-1.1\constraint-layout-1.0.0-alpha9.aar\fe44ccfcda72497e5f8b3e7c4ae6bd3f\AndroidManifest.xml:2:1-11:12
MERGED from [com.simplecityapps:recyclerview-fastscroll:1.0.11] C:\Users\Janah\.gradle\caches\transforms-1\files-1.1\recyclerview-fastscroll-1.0.11.aar\8316747a88363ae94df50fbcf0a4f183\AndroidManifest.xml:2:1-9:12
MERGED from [com.android.support:cardview-v7:25.3.1] C:\Users\Janah\.gradle\caches\transforms-1\files-1.1\cardview-v7-25.3.1.aar\bcd2d8e6e19d48d7aeff7b5a3cdb5403\AndroidManifest.xml:17:1-28:12
MERGED from [com.google.firebase:firebase-database:10.2.0] C:\Users\Janah\.gradle\caches\transforms-1\files-1.1\firebase-database-10.2.0.aar\5aa5963576a39054a6f89c03db920f9b\AndroidManifest.xml:2:1-4:12
MERGED from [com.google.firebase:firebase-storage:10.2.0] C:\Users\Janah\.gradle\caches\transforms-1\files-1.1\firebase-storage-10.2.0.aar\6d43ec0c514a659cdd4654983747abc9\AndroidManifest.xml:2:1-4:12
MERGED from [com.google.firebase:firebase-auth:10.2.0] C:\Users\Janah\.gradle\caches\transforms-1\files-1.1\firebase-auth-10.2.0.aar\7076ee9dce4eb003cc40b622d00d2929\AndroidManifest.xml:16:1-21:12
MERGED from [de.hdodenhof:circleimageview:2.1.0] C:\Users\Janah\.gradle\caches\transforms-1\files-1.1\circleimageview-2.1.0.aar\f0df384fcc7c9ad8cb024f336e615ca6\AndroidManifest.xml:2:1-11:12
MERGED from [com.google.firebase:firebase-core:10.2.0] C:\Users\Janah\.gradle\caches\transforms-1\files-1.1\firebase-core-10.2.0.aar\468df92178864585bb3e2fecc575284d\AndroidManifest.xml:2:1-6:12
MERGED from [com.twotoasters.jazzylistview:library-recyclerview:1.2.1] C:\Users\Janah\.gradle\caches\transforms-1\files-1.1\library-recyclerview-1.2.1.aar\9ffe447af5543dd32d2fbba6cbc9e32d\AndroidManifest.xml:2:1-11:12
MERGED from [com.twotoasters.jazzylistview:library:1.2.1] C:\Users\Janah\.gradle\caches\transforms-1\files-1.1\library-1.2.1.aar\cdcdf77a581f6b6b14cc90789cd8723f\AndroidManifest.xml:2:1-11:12
MERGED from [com.android.support:transition:25.3.1] C:\Users\Janah\.gradle\caches\transforms-1\files-1.1\transition-25.3.1.aar\2114707b5b460f21b739aa2fa40bef60\AndroidManifest.xml:17:1-28:12
MERGED from [com.android.support:recyclerview-v7:25.3.1] C:\Users\Janah\.gradle\caches\transforms-1\files-1.1\recyclerview-v7-25.3.1.aar\2b94e9820404db7eb124593a2362e439\AndroidManifest.xml:17:1-26:12
MERGED from [com.google.firebase:firebase-analytics:10.2.0] C:\Users\Janah\.gradle\caches\transforms-1\files-1.1\firebase-analytics-10.2.0.aar\24f061ab444ce3130cb8a1bdbce81666\AndroidManifest.xml:16:1-34:12
MERGED from [com.google.firebase:firebase-analytics-impl:10.2.0] C:\Users\Janah\.gradle\caches\transforms-1\files-1.1\firebase-analytics-impl-10.2.0.aar\608ad5a997fd328817be193060752850\AndroidManifest.xml:16:1-29:12
MERGED from [com.google.firebase:firebase-iid:10.2.0] C:\Users\Janah\.gradle\caches\transforms-1\files-1.1\firebase-iid-10.2.0.aar\d0f57b03a06699f08196f089500d44e6\AndroidManifest.xml:16:1-51:12
MERGED from [com.google.firebase:firebase-database-connection:10.2.0] C:\Users\Janah\.gradle\caches\transforms-1\files-1.1\firebase-database-connection-10.2.0.aar\082613b470d4127fdc8ef9918ec0db95\AndroidManifest.xml:2:1-4:12
MERGED from [com.google.firebase:firebase-common:10.2.0] C:\Users\Janah\.gradle\caches\transforms-1\files-1.1\firebase-common-10.2.0.aar\0c362d38814ff12de00e2a7210a19d1b\AndroidManifest.xml:2:1-8:12
MERGED from [com.google.android.gms:play-services-base:10.2.0] C:\Users\Janah\.gradle\caches\transforms-1\files-1.1\play-services-base-10.2.0.aar\89e00ae2f6ad347f0e4feeb69391705d\AndroidManifest.xml:16:1-21:12
MERGED from [com.google.android.gms:play-services-tasks:10.2.0] C:\Users\Janah\.gradle\caches\transforms-1\files-1.1\play-services-tasks-10.2.0.aar\8d7168a16019ffd07266f72ccddc40af\AndroidManifest.xml:2:1-5:12
MERGED from [com.google.firebase:firebase-storage-common:10.2.0] C:\Users\Janah\.gradle\caches\transforms-1\files-1.1\firebase-storage-common-10.2.0.aar\7596dfbce8162e6ccb05adf596eeac13\AndroidManifest.xml:2:1-4:12
MERGED from [com.google.android.gms:play-services-basement:10.2.0] C:\Users\Janah\.gradle\caches\transforms-1\files-1.1\play-services-basement-10.2.0.aar\a85b193fdc8ae32eaf4a3e204b551615\AndroidManifest.xml:16:1-23:12
MERGED from [com.android.support:support-v4:25.3.1] C:\Users\Janah\.gradle\caches\transforms-1\files-1.1\support-v4-25.3.1.aar\d7734d9e82b42dd81c153aab9e9839ab\AndroidManifest.xml:17:1-31:12
MERGED from [com.android.support:support-fragment:25.3.1] C:\Users\Janah\.gradle\caches\transforms-1\files-1.1\support-fragment-25.3.1.aar\f285717b311ee1ea94a399a4fdfdba51\AndroidManifest.xml:17:1-31:12
MERGED from [com.android.support:support-core-ui:25.3.1] C:\Users\Janah\.gradle\caches\transforms-1\files-1.1\support-core-ui-25.3.1.aar\7ef3ef791c560d545dc9b4cd09e2b96c\AndroidManifest.xml:17:1-31:12
MERGED from [com.android.support:animated-vector-drawable:25.3.1] C:\Users\Janah\.gradle\caches\transforms-1\files-1.1\animated-vector-drawable-25.3.1.aar\b4745ef14b40364a825a12ffdb41ba68\AndroidManifest.xml:17:1-28:12
MERGED from [com.android.support:support-vector-drawable:25.3.1] C:\Users\Janah\.gradle\caches\transforms-1\files-1.1\support-vector-drawable-25.3.1.aar\66be67059cf1f725b6b3ef55c2d8f62c\AndroidManifest.xml:17:1-28:12
MERGED from [com.android.support:support-media-compat:25.3.1] C:\Users\Janah\.gradle\caches\transforms-1\files-1.1\support-media-compat-25.3.1.aar\a958c1d33345d99a5a917249dbd96004\AndroidManifest.xml:17:1-31:12
MERGED from [com.android.support:support-core-utils:25.3.1] C:\Users\Janah\.gradle\caches\transforms-1\files-1.1\support-core-utils-25.3.1.aar\2e818a72ca1669f5e00bb52b75e786aa\AndroidManifest.xml:17:1-31:12
MERGED from [com.android.support:support-compat:25.3.1] C:\Users\Janah\.gradle\caches\transforms-1\files-1.1\support-compat-25.3.1.aar\8859a71adc1908fae2e34b34b95f1bb1\AndroidManifest.xml:17:1-31:12
INJECTED from D:\Informatique de gestion\Session ete 2018\Programmation mobile 2\ProjetFitness\app\src\main\AndroidManifest.xml:2:1-78:12
INJECTED from D:\Informatique de gestion\Session ete 2018\Programmation mobile 2\ProjetFitness\app\src\main\AndroidManifest.xml:2:1-78:12
INJECTED from D:\Informatique de gestion\Session ete 2018\Programmation mobile 2\ProjetFitness\app\src\main\AndroidManifest.xml:2:1-78:12
	package
		ADDED from D:\Informatique de gestion\Session ete 2018\Programmation mobile 2\ProjetFitness\app\src\main\AndroidManifest.xml:3:5-32
		INJECTED from D:\Informatique de gestion\Session ete 2018\Programmation mobile 2\ProjetFitness\app\src\main\AndroidManifest.xml
		INJECTED from D:\Informatique de gestion\Session ete 2018\Programmation mobile 2\ProjetFitness\app\src\main\AndroidManifest.xml
	android:versionName
		INJECTED from D:\Informatique de gestion\Session ete 2018\Programmation mobile 2\ProjetFitness\app\src\main\AndroidManifest.xml
		ADDED from D:\Informatique de gestion\Session ete 2018\Programmation mobile 2\ProjetFitness\app\src\main\AndroidManifest.xml:2:1-78:12
		INJECTED from D:\Informatique de gestion\Session ete 2018\Programmation mobile 2\ProjetFitness\app\src\main\AndroidManifest.xml
	android:versionCode
		INJECTED from D:\Informatique de gestion\Session ete 2018\Programmation mobile 2\ProjetFitness\app\src\main\AndroidManifest.xml
		ADDED from D:\Informatique de gestion\Session ete 2018\Programmation mobile 2\ProjetFitness\app\src\main\AndroidManifest.xml:2:1-78:12
		INJECTED from D:\Informatique de gestion\Session ete 2018\Programmation mobile 2\ProjetFitness\app\src\main\AndroidManifest.xml
	xmlns:android
		ADDED from D:\Informatique de gestion\Session ete 2018\Programmation mobile 2\ProjetFitness\app\src\main\AndroidManifest.xml:2:11-69
uses-permission#android.permission.INTERNET
ADDED from D:\Informatique de gestion\Session ete 2018\Programmation mobile 2\ProjetFitness\app\src\main\AndroidManifest.xml:6:5-67
MERGED from [com.firebaseui:firebase-ui-database:0.4.0] C:\Users\Janah\.gradle\caches\transforms-1\files-1.1\firebase-ui-database-0.4.0.aar\2cfc8800410f77c747a6c5e4f8b8add4\AndroidManifest.xml:11:5-67
MERGED from [com.firebaseui:firebase-ui-database:0.4.0] C:\Users\Janah\.gradle\caches\transforms-1\files-1.1\firebase-ui-database-0.4.0.aar\2cfc8800410f77c747a6c5e4f8b8add4\AndroidManifest.xml:11:5-67
MERGED from [com.google.firebase:firebase-analytics:10.2.0] C:\Users\Janah\.gradle\caches\transforms-1\files-1.1\firebase-analytics-10.2.0.aar\24f061ab444ce3130cb8a1bdbce81666\AndroidManifest.xml:20:5-66
MERGED from [com.google.firebase:firebase-analytics:10.2.0] C:\Users\Janah\.gradle\caches\transforms-1\files-1.1\firebase-analytics-10.2.0.aar\24f061ab444ce3130cb8a1bdbce81666\AndroidManifest.xml:20:5-66
MERGED from [com.google.firebase:firebase-analytics-impl:10.2.0] C:\Users\Janah\.gradle\caches\transforms-1\files-1.1\firebase-analytics-impl-10.2.0.aar\608ad5a997fd328817be193060752850\AndroidManifest.xml:20:5-66
MERGED from [com.google.firebase:firebase-analytics-impl:10.2.0] C:\Users\Janah\.gradle\caches\transforms-1\files-1.1\firebase-analytics-impl-10.2.0.aar\608ad5a997fd328817be193060752850\AndroidManifest.xml:20:5-66
MERGED from [com.google.firebase:firebase-iid:10.2.0] C:\Users\Janah\.gradle\caches\transforms-1\files-1.1\firebase-iid-10.2.0.aar\d0f57b03a06699f08196f089500d44e6\AndroidManifest.xml:20:5-66
MERGED from [com.google.firebase:firebase-iid:10.2.0] C:\Users\Janah\.gradle\caches\transforms-1\files-1.1\firebase-iid-10.2.0.aar\d0f57b03a06699f08196f089500d44e6\AndroidManifest.xml:20:5-66
	android:name
		ADDED from D:\Informatique de gestion\Session ete 2018\Programmation mobile 2\ProjetFitness\app\src\main\AndroidManifest.xml:6:22-64
uses-permission#android.permission.ACCESS_NETWORK_STATE
ADDED from D:\Informatique de gestion\Session ete 2018\Programmation mobile 2\ProjetFitness\app\src\main\AndroidManifest.xml:7:5-79
MERGED from [com.google.firebase:firebase-analytics:10.2.0] C:\Users\Janah\.gradle\caches\transforms-1\files-1.1\firebase-analytics-10.2.0.aar\24f061ab444ce3130cb8a1bdbce81666\AndroidManifest.xml:21:5-78
MERGED from [com.google.firebase:firebase-analytics:10.2.0] C:\Users\Janah\.gradle\caches\transforms-1\files-1.1\firebase-analytics-10.2.0.aar\24f061ab444ce3130cb8a1bdbce81666\AndroidManifest.xml:21:5-78
MERGED from [com.google.firebase:firebase-analytics-impl:10.2.0] C:\Users\Janah\.gradle\caches\transforms-1\files-1.1\firebase-analytics-impl-10.2.0.aar\608ad5a997fd328817be193060752850\AndroidManifest.xml:21:5-78
MERGED from [com.google.firebase:firebase-analytics-impl:10.2.0] C:\Users\Janah\.gradle\caches\transforms-1\files-1.1\firebase-analytics-impl-10.2.0.aar\608ad5a997fd328817be193060752850\AndroidManifest.xml:21:5-78
MERGED from [com.google.firebase:firebase-iid:10.2.0] C:\Users\Janah\.gradle\caches\transforms-1\files-1.1\firebase-iid-10.2.0.aar\d0f57b03a06699f08196f089500d44e6\AndroidManifest.xml:19:5-78
MERGED from [com.google.firebase:firebase-iid:10.2.0] C:\Users\Janah\.gradle\caches\transforms-1\files-1.1\firebase-iid-10.2.0.aar\d0f57b03a06699f08196f089500d44e6\AndroidManifest.xml:19:5-78
	android:name
		ADDED from D:\Informatique de gestion\Session ete 2018\Programmation mobile 2\ProjetFitness\app\src\main\AndroidManifest.xml:7:22-76
uses-permission#android.permission.CAMERA
ADDED from D:\Informatique de gestion\Session ete 2018\Programmation mobile 2\ProjetFitness\app\src\main\AndroidManifest.xml:10:5-65
	android:name
		ADDED from D:\Informatique de gestion\Session ete 2018\Programmation mobile 2\ProjetFitness\app\src\main\AndroidManifest.xml:10:22-62
uses-permission#android.permission.READ_EXTERNAL_STORAGE
ADDED from D:\Informatique de gestion\Session ete 2018\Programmation mobile 2\ProjetFitness\app\src\main\AndroidManifest.xml:13:5-80
	android:name
		ADDED from D:\Informatique de gestion\Session ete 2018\Programmation mobile 2\ProjetFitness\app\src\main\AndroidManifest.xml:13:22-77
uses-permission#android.permission.WRITE_EXTERNAL_STORAGE
ADDED from D:\Informatique de gestion\Session ete 2018\Programmation mobile 2\ProjetFitness\app\src\main\AndroidManifest.xml:14:5-81
	android:name
		ADDED from D:\Informatique de gestion\Session ete 2018\Programmation mobile 2\ProjetFitness\app\src\main\AndroidManifest.xml:14:22-78
application
ADDED from D:\Informatique de gestion\Session ete 2018\Programmation mobile 2\ProjetFitness\app\src\main\AndroidManifest.xml:16:5-76:19
MERGED from [com.android.support:design:25.3.1] C:\Users\Janah\.gradle\caches\transforms-1\files-1.1\design-25.3.1.aar\0e2070721a9a891b7a7330fb9fca55d5\AndroidManifest.xml:29:5-20
MERGED from [com.android.support:design:25.3.1] C:\Users\Janah\.gradle\caches\transforms-1\files-1.1\design-25.3.1.aar\0e2070721a9a891b7a7330fb9fca55d5\AndroidManifest.xml:29:5-20
MERGED from [com.android.support:appcompat-v7:25.3.1] C:\Users\Janah\.gradle\caches\transforms-1\files-1.1\appcompat-v7-25.3.1.aar\20ab1132e95f01ccb9793ac7d0fe9445\AndroidManifest.xml:29:5-20
MERGED from [com.android.support:appcompat-v7:25.3.1] C:\Users\Janah\.gradle\caches\transforms-1\files-1.1\appcompat-v7-25.3.1.aar\20ab1132e95f01ccb9793ac7d0fe9445\AndroidManifest.xml:29:5-20
MERGED from [com.android.support.constraint:constraint-layout:1.0.0-alpha9] C:\Users\Janah\.gradle\caches\transforms-1\files-1.1\constraint-layout-1.0.0-alpha9.aar\fe44ccfcda72497e5f8b3e7c4ae6bd3f\AndroidManifest.xml:9:5-20
MERGED from [com.android.support.constraint:constraint-layout:1.0.0-alpha9] C:\Users\Janah\.gradle\caches\transforms-1\files-1.1\constraint-layout-1.0.0-alpha9.aar\fe44ccfcda72497e5f8b3e7c4ae6bd3f\AndroidManifest.xml:9:5-20
MERGED from [com.android.support:cardview-v7:25.3.1] C:\Users\Janah\.gradle\caches\transforms-1\files-1.1\cardview-v7-25.3.1.aar\bcd2d8e6e19d48d7aeff7b5a3cdb5403\AndroidManifest.xml:26:5-20
MERGED from [com.android.support:cardview-v7:25.3.1] C:\Users\Janah\.gradle\caches\transforms-1\files-1.1\cardview-v7-25.3.1.aar\bcd2d8e6e19d48d7aeff7b5a3cdb5403\AndroidManifest.xml:26:5-20
MERGED from [com.google.firebase:firebase-auth:10.2.0] C:\Users\Janah\.gradle\caches\transforms-1\files-1.1\firebase-auth-10.2.0.aar\7076ee9dce4eb003cc40b622d00d2929\AndroidManifest.xml:19:5-20:19
MERGED from [com.google.firebase:firebase-auth:10.2.0] C:\Users\Janah\.gradle\caches\transforms-1\files-1.1\firebase-auth-10.2.0.aar\7076ee9dce4eb003cc40b622d00d2929\AndroidManifest.xml:19:5-20:19
MERGED from [de.hdodenhof:circleimageview:2.1.0] C:\Users\Janah\.gradle\caches\transforms-1\files-1.1\circleimageview-2.1.0.aar\f0df384fcc7c9ad8cb024f336e615ca6\AndroidManifest.xml:9:5-20
MERGED from [de.hdodenhof:circleimageview:2.1.0] C:\Users\Janah\.gradle\caches\transforms-1\files-1.1\circleimageview-2.1.0.aar\f0df384fcc7c9ad8cb024f336e615ca6\AndroidManifest.xml:9:5-20
MERGED from [com.google.firebase:firebase-core:10.2.0] C:\Users\Janah\.gradle\caches\transforms-1\files-1.1\firebase-core-10.2.0.aar\468df92178864585bb3e2fecc575284d\AndroidManifest.xml:5:5-20
MERGED from [com.google.firebase:firebase-core:10.2.0] C:\Users\Janah\.gradle\caches\transforms-1\files-1.1\firebase-core-10.2.0.aar\468df92178864585bb3e2fecc575284d\AndroidManifest.xml:5:5-20
MERGED from [com.android.support:transition:25.3.1] C:\Users\Janah\.gradle\caches\transforms-1\files-1.1\transition-25.3.1.aar\2114707b5b460f21b739aa2fa40bef60\AndroidManifest.xml:26:5-20
MERGED from [com.android.support:transition:25.3.1] C:\Users\Janah\.gradle\caches\transforms-1\files-1.1\transition-25.3.1.aar\2114707b5b460f21b739aa2fa40bef60\AndroidManifest.xml:26:5-20
MERGED from [com.google.firebase:firebase-analytics:10.2.0] C:\Users\Janah\.gradle\caches\transforms-1\files-1.1\firebase-analytics-10.2.0.aar\24f061ab444ce3130cb8a1bdbce81666\AndroidManifest.xml:24:5-33:19
MERGED from [com.google.firebase:firebase-analytics:10.2.0] C:\Users\Janah\.gradle\caches\transforms-1\files-1.1\firebase-analytics-10.2.0.aar\24f061ab444ce3130cb8a1bdbce81666\AndroidManifest.xml:24:5-33:19
MERGED from [com.google.firebase:firebase-analytics-impl:10.2.0] C:\Users\Janah\.gradle\caches\transforms-1\files-1.1\firebase-analytics-impl-10.2.0.aar\608ad5a997fd328817be193060752850\AndroidManifest.xml:24:5-28:19
MERGED from [com.google.firebase:firebase-analytics-impl:10.2.0] C:\Users\Janah\.gradle\caches\transforms-1\files-1.1\firebase-analytics-impl-10.2.0.aar\608ad5a997fd328817be193060752850\AndroidManifest.xml:24:5-28:19
MERGED from [com.google.firebase:firebase-iid:10.2.0] C:\Users\Janah\.gradle\caches\transforms-1\files-1.1\firebase-iid-10.2.0.aar\d0f57b03a06699f08196f089500d44e6\AndroidManifest.xml:28:5-50:19
MERGED from [com.google.firebase:firebase-iid:10.2.0] C:\Users\Janah\.gradle\caches\transforms-1\files-1.1\firebase-iid-10.2.0.aar\d0f57b03a06699f08196f089500d44e6\AndroidManifest.xml:28:5-50:19
MERGED from [com.google.firebase:firebase-common:10.2.0] C:\Users\Janah\.gradle\caches\transforms-1\files-1.1\firebase-common-10.2.0.aar\0c362d38814ff12de00e2a7210a19d1b\AndroidManifest.xml:4:5-7:19
MERGED from [com.google.firebase:firebase-common:10.2.0] C:\Users\Janah\.gradle\caches\transforms-1\files-1.1\firebase-common-10.2.0.aar\0c362d38814ff12de00e2a7210a19d1b\AndroidManifest.xml:4:5-7:19
MERGED from [com.google.android.gms:play-services-base:10.2.0] C:\Users\Janah\.gradle\caches\transforms-1\files-1.1\play-services-base-10.2.0.aar\89e00ae2f6ad347f0e4feeb69391705d\AndroidManifest.xml:18:5-20:19
MERGED from [com.google.android.gms:play-services-base:10.2.0] C:\Users\Janah\.gradle\caches\transforms-1\files-1.1\play-services-base-10.2.0.aar\89e00ae2f6ad347f0e4feeb69391705d\AndroidManifest.xml:18:5-20:19
MERGED from [com.google.android.gms:play-services-tasks:10.2.0] C:\Users\Janah\.gradle\caches\transforms-1\files-1.1\play-services-tasks-10.2.0.aar\8d7168a16019ffd07266f72ccddc40af\AndroidManifest.xml:4:5-19
MERGED from [com.google.android.gms:play-services-tasks:10.2.0] C:\Users\Janah\.gradle\caches\transforms-1\files-1.1\play-services-tasks-10.2.0.aar\8d7168a16019ffd07266f72ccddc40af\AndroidManifest.xml:4:5-19
MERGED from [com.google.android.gms:play-services-basement:10.2.0] C:\Users\Janah\.gradle\caches\transforms-1\files-1.1\play-services-basement-10.2.0.aar\a85b193fdc8ae32eaf4a3e204b551615\AndroidManifest.xml:19:5-21:19
MERGED from [com.google.android.gms:play-services-basement:10.2.0] C:\Users\Janah\.gradle\caches\transforms-1\files-1.1\play-services-basement-10.2.0.aar\a85b193fdc8ae32eaf4a3e204b551615\AndroidManifest.xml:19:5-21:19
MERGED from [com.android.support:support-v4:25.3.1] C:\Users\Janah\.gradle\caches\transforms-1\files-1.1\support-v4-25.3.1.aar\d7734d9e82b42dd81c153aab9e9839ab\AndroidManifest.xml:29:5-20
MERGED from [com.android.support:support-v4:25.3.1] C:\Users\Janah\.gradle\caches\transforms-1\files-1.1\support-v4-25.3.1.aar\d7734d9e82b42dd81c153aab9e9839ab\AndroidManifest.xml:29:5-20
MERGED from [com.android.support:support-fragment:25.3.1] C:\Users\Janah\.gradle\caches\transforms-1\files-1.1\support-fragment-25.3.1.aar\f285717b311ee1ea94a399a4fdfdba51\AndroidManifest.xml:29:5-20
MERGED from [com.android.support:support-fragment:25.3.1] C:\Users\Janah\.gradle\caches\transforms-1\files-1.1\support-fragment-25.3.1.aar\f285717b311ee1ea94a399a4fdfdba51\AndroidManifest.xml:29:5-20
MERGED from [com.android.support:support-core-ui:25.3.1] C:\Users\Janah\.gradle\caches\transforms-1\files-1.1\support-core-ui-25.3.1.aar\7ef3ef791c560d545dc9b4cd09e2b96c\AndroidManifest.xml:29:5-20
MERGED from [com.android.support:support-core-ui:25.3.1] C:\Users\Janah\.gradle\caches\transforms-1\files-1.1\support-core-ui-25.3.1.aar\7ef3ef791c560d545dc9b4cd09e2b96c\AndroidManifest.xml:29:5-20
MERGED from [com.android.support:animated-vector-drawable:25.3.1] C:\Users\Janah\.gradle\caches\transforms-1\files-1.1\animated-vector-drawable-25.3.1.aar\b4745ef14b40364a825a12ffdb41ba68\AndroidManifest.xml:26:5-20
MERGED from [com.android.support:animated-vector-drawable:25.3.1] C:\Users\Janah\.gradle\caches\transforms-1\files-1.1\animated-vector-drawable-25.3.1.aar\b4745ef14b40364a825a12ffdb41ba68\AndroidManifest.xml:26:5-20
MERGED from [com.android.support:support-vector-drawable:25.3.1] C:\Users\Janah\.gradle\caches\transforms-1\files-1.1\support-vector-drawable-25.3.1.aar\66be67059cf1f725b6b3ef55c2d8f62c\AndroidManifest.xml:26:5-20
MERGED from [com.android.support:support-vector-drawable:25.3.1] C:\Users\Janah\.gradle\caches\transforms-1\files-1.1\support-vector-drawable-25.3.1.aar\66be67059cf1f725b6b3ef55c2d8f62c\AndroidManifest.xml:26:5-20
MERGED from [com.android.support:support-media-compat:25.3.1] C:\Users\Janah\.gradle\caches\transforms-1\files-1.1\support-media-compat-25.3.1.aar\a958c1d33345d99a5a917249dbd96004\AndroidManifest.xml:29:5-20
MERGED from [com.android.support:support-media-compat:25.3.1] C:\Users\Janah\.gradle\caches\transforms-1\files-1.1\support-media-compat-25.3.1.aar\a958c1d33345d99a5a917249dbd96004\AndroidManifest.xml:29:5-20
MERGED from [com.android.support:support-core-utils:25.3.1] C:\Users\Janah\.gradle\caches\transforms-1\files-1.1\support-core-utils-25.3.1.aar\2e818a72ca1669f5e00bb52b75e786aa\AndroidManifest.xml:29:5-20
MERGED from [com.android.support:support-core-utils:25.3.1] C:\Users\Janah\.gradle\caches\transforms-1\files-1.1\support-core-utils-25.3.1.aar\2e818a72ca1669f5e00bb52b75e786aa\AndroidManifest.xml:29:5-20
MERGED from [com.android.support:support-compat:25.3.1] C:\Users\Janah\.gradle\caches\transforms-1\files-1.1\support-compat-25.3.1.aar\8859a71adc1908fae2e34b34b95f1bb1\AndroidManifest.xml:29:5-20
MERGED from [com.android.support:support-compat:25.3.1] C:\Users\Janah\.gradle\caches\transforms-1\files-1.1\support-compat-25.3.1.aar\8859a71adc1908fae2e34b34b95f1bb1\AndroidManifest.xml:29:5-20
	android:supportsRtl
		ADDED from D:\Informatique de gestion\Session ete 2018\Programmation mobile 2\ProjetFitness\app\src\main\AndroidManifest.xml:21:9-35
	android:label
		ADDED from D:\Informatique de gestion\Session ete 2018\Programmation mobile 2\ProjetFitness\app\src\main\AndroidManifest.xml:19:9-41
	android:roundIcon
		ADDED from D:\Informatique de gestion\Session ete 2018\Programmation mobile 2\ProjetFitness\app\src\main\AndroidManifest.xml:20:9-48
	android:icon
		ADDED from D:\Informatique de gestion\Session ete 2018\Programmation mobile 2\ProjetFitness\app\src\main\AndroidManifest.xml:18:9-43
	android:allowBackup
		ADDED from D:\Informatique de gestion\Session ete 2018\Programmation mobile 2\ProjetFitness\app\src\main\AndroidManifest.xml:17:9-35
	android:theme
		ADDED from D:\Informatique de gestion\Session ete 2018\Programmation mobile 2\ProjetFitness\app\src\main\AndroidManifest.xml:22:9-40
activity#com.globalfitness.MainActivity
ADDED from D:\Informatique de gestion\Session ete 2018\Programmation mobile 2\ProjetFitness\app\src\main\AndroidManifest.xml:23:9-28:20
	android:label
		ADDED from D:\Informatique de gestion\Session ete 2018\Programmation mobile 2\ProjetFitness\app\src\main\AndroidManifest.xml:25:13-45
	android:theme
		ADDED from D:\Informatique de gestion\Session ete 2018\Programmation mobile 2\ProjetFitness\app\src\main\AndroidManifest.xml:26:13-56
	android:name
		ADDED from D:\Informatique de gestion\Session ete 2018\Programmation mobile 2\ProjetFitness\app\src\main\AndroidManifest.xml:24:13-58
activity#com.globalfitness.SplashScreenActivity
ADDED from D:\Informatique de gestion\Session ete 2018\Programmation mobile 2\ProjetFitness\app\src\main\AndroidManifest.xml:30:9-37:20
	android:name
		ADDED from D:\Informatique de gestion\Session ete 2018\Programmation mobile 2\ProjetFitness\app\src\main\AndroidManifest.xml:30:19-72
intent-filter#action:name:android.intent.action.MAIN+category:name:android.intent.category.LAUNCHER
ADDED from D:\Informatique de gestion\Session ete 2018\Programmation mobile 2\ProjetFitness\app\src\main\AndroidManifest.xml:32:13-36:29
action#android.intent.action.MAIN
ADDED from D:\Informatique de gestion\Session ete 2018\Programmation mobile 2\ProjetFitness\app\src\main\AndroidManifest.xml:33:17-69
	android:name
		ADDED from D:\Informatique de gestion\Session ete 2018\Programmation mobile 2\ProjetFitness\app\src\main\AndroidManifest.xml:33:25-66
category#android.intent.category.LAUNCHER
ADDED from D:\Informatique de gestion\Session ete 2018\Programmation mobile 2\ProjetFitness\app\src\main\AndroidManifest.xml:35:17-77
	android:name
		ADDED from D:\Informatique de gestion\Session ete 2018\Programmation mobile 2\ProjetFitness\app\src\main\AndroidManifest.xml:35:27-74
activity#com.globalfitness.WorkoutTypesActivity
ADDED from D:\Informatique de gestion\Session ete 2018\Programmation mobile 2\ProjetFitness\app\src\main\AndroidManifest.xml:40:9-41:20
	android:name
		ADDED from D:\Informatique de gestion\Session ete 2018\Programmation mobile 2\ProjetFitness\app\src\main\AndroidManifest.xml:40:19-72
activity#com.globalfitness.BmiActivity
ADDED from D:\Informatique de gestion\Session ete 2018\Programmation mobile 2\ProjetFitness\app\src\main\AndroidManifest.xml:43:9-44:20
	android:name
		ADDED from D:\Informatique de gestion\Session ete 2018\Programmation mobile 2\ProjetFitness\app\src\main\AndroidManifest.xml:43:19-63
activity#com.globalfitness.DetailsActivity
ADDED from D:\Informatique de gestion\Session ete 2018\Programmation mobile 2\ProjetFitness\app\src\main\AndroidManifest.xml:47:9-48:20
	android:name
		ADDED from D:\Informatique de gestion\Session ete 2018\Programmation mobile 2\ProjetFitness\app\src\main\AndroidManifest.xml:47:19-67
activity#com.globalfitness.ProgramsActivity
ADDED from D:\Informatique de gestion\Session ete 2018\Programmation mobile 2\ProjetFitness\app\src\main\AndroidManifest.xml:50:9-51:20
	android:name
		ADDED from D:\Informatique de gestion\Session ete 2018\Programmation mobile 2\ProjetFitness\app\src\main\AndroidManifest.xml:50:19-68
activity#com.globalfitness.SignInActivity
ADDED from D:\Informatique de gestion\Session ete 2018\Programmation mobile 2\ProjetFitness\app\src\main\AndroidManifest.xml:53:9-54:20
	android:name
		ADDED from D:\Informatique de gestion\Session ete 2018\Programmation mobile 2\ProjetFitness\app\src\main\AndroidManifest.xml:53:19-66
activity#com.globalfitness.SignUpActivity
ADDED from D:\Informatique de gestion\Session ete 2018\Programmation mobile 2\ProjetFitness\app\src\main\AndroidManifest.xml:56:9-57:20
	android:name
		ADDED from D:\Informatique de gestion\Session ete 2018\Programmation mobile 2\ProjetFitness\app\src\main\AndroidManifest.xml:56:19-66
activity#com.globalfitness.SettingsActivity
ADDED from D:\Informatique de gestion\Session ete 2018\Programmation mobile 2\ProjetFitness\app\src\main\AndroidManifest.xml:59:9-60:20
	android:name
		ADDED from D:\Informatique de gestion\Session ete 2018\Programmation mobile 2\ProjetFitness\app\src\main\AndroidManifest.xml:59:19-68
activity#com.globalfitness.ChangePasswordActivity
ADDED from D:\Informatique de gestion\Session ete 2018\Programmation mobile 2\ProjetFitness\app\src\main\AndroidManifest.xml:62:9-63:20
	android:name
		ADDED from D:\Informatique de gestion\Session ete 2018\Programmation mobile 2\ProjetFitness\app\src\main\AndroidManifest.xml:62:19-74
activity#com.yalantis.ucrop.UCropActivity
ADDED from D:\Informatique de gestion\Session ete 2018\Programmation mobile 2\ProjetFitness\app\src\main\AndroidManifest.xml:65:9-68:72
	android:screenOrientation
		ADDED from D:\Informatique de gestion\Session ete 2018\Programmation mobile 2\ProjetFitness\app\src\main\AndroidManifest.xml:67:13-49
	android:theme
		ADDED from D:\Informatique de gestion\Session ete 2018\Programmation mobile 2\ProjetFitness\app\src\main\AndroidManifest.xml:68:13-69
	android:name
		ADDED from D:\Informatique de gestion\Session ete 2018\Programmation mobile 2\ProjetFitness\app\src\main\AndroidManifest.xml:66:13-60
activity#com.globalfitness.FullscreenVideoActivity
ADDED from D:\Informatique de gestion\Session ete 2018\Programmation mobile 2\ProjetFitness\app\src\main\AndroidManifest.xml:70:9-73:20
	android:screenOrientation
		ADDED from D:\Informatique de gestion\Session ete 2018\Programmation mobile 2\ProjetFitness\app\src\main\AndroidManifest.xml:72:13-50
	android:name
		ADDED from D:\Informatique de gestion\Session ete 2018\Programmation mobile 2\ProjetFitness\app\src\main\AndroidManifest.xml:71:13-69
uses-sdk
INJECTED from D:\Informatique de gestion\Session ete 2018\Programmation mobile 2\ProjetFitness\app\src\main\AndroidManifest.xml reason: use-sdk injection requested
INJECTED from D:\Informatique de gestion\Session ete 2018\Programmation mobile 2\ProjetFitness\app\src\main\AndroidManifest.xml
INJECTED from D:\Informatique de gestion\Session ete 2018\Programmation mobile 2\ProjetFitness\app\src\main\AndroidManifest.xml
MERGED from [com.android.support:design:25.3.1] C:\Users\Janah\.gradle\caches\transforms-1\files-1.1\design-25.3.1.aar\0e2070721a9a891b7a7330fb9fca55d5\AndroidManifest.xml:21:5-23:62
MERGED from [com.android.support:design:25.3.1] C:\Users\Janah\.gradle\caches\transforms-1\files-1.1\design-25.3.1.aar\0e2070721a9a891b7a7330fb9fca55d5\AndroidManifest.xml:21:5-23:62
MERGED from [com.firebaseui:firebase-ui-database:0.4.0] C:\Users\Janah\.gradle\caches\transforms-1\files-1.1\firebase-ui-database-0.4.0.aar\2cfc8800410f77c747a6c5e4f8b8add4\AndroidManifest.xml:7:5-9:41
MERGED from [com.firebaseui:firebase-ui-database:0.4.0] C:\Users\Janah\.gradle\caches\transforms-1\files-1.1\firebase-ui-database-0.4.0.aar\2cfc8800410f77c747a6c5e4f8b8add4\AndroidManifest.xml:7:5-9:41
MERGED from [com.yalantis:ucrop:2.2.0] C:\Users\Janah\.gradle\caches\transforms-1\files-1.1\ucrop-2.2.0.aar\9cb82cd90faaf3bd40496806861d5d9a\AndroidManifest.xml:8:5-10:41
MERGED from [com.yalantis:ucrop:2.2.0] C:\Users\Janah\.gradle\caches\transforms-1\files-1.1\ucrop-2.2.0.aar\9cb82cd90faaf3bd40496806861d5d9a\AndroidManifest.xml:8:5-10:41
MERGED from [com.android.support:appcompat-v7:25.3.1] C:\Users\Janah\.gradle\caches\transforms-1\files-1.1\appcompat-v7-25.3.1.aar\20ab1132e95f01ccb9793ac7d0fe9445\AndroidManifest.xml:21:5-23:78
MERGED from [com.android.support:appcompat-v7:25.3.1] C:\Users\Janah\.gradle\caches\transforms-1\files-1.1\appcompat-v7-25.3.1.aar\20ab1132e95f01ccb9793ac7d0fe9445\AndroidManifest.xml:21:5-23:78
MERGED from [com.android.support.constraint:constraint-layout:1.0.0-alpha9] C:\Users\Janah\.gradle\caches\transforms-1\files-1.1\constraint-layout-1.0.0-alpha9.aar\fe44ccfcda72497e5f8b3e7c4ae6bd3f\AndroidManifest.xml:5:5-7:41
MERGED from [com.android.support.constraint:constraint-layout:1.0.0-alpha9] C:\Users\Janah\.gradle\caches\transforms-1\files-1.1\constraint-layout-1.0.0-alpha9.aar\fe44ccfcda72497e5f8b3e7c4ae6bd3f\AndroidManifest.xml:5:5-7:41
MERGED from [com.simplecityapps:recyclerview-fastscroll:1.0.11] C:\Users\Janah\.gradle\caches\transforms-1\files-1.1\recyclerview-fastscroll-1.0.11.aar\8316747a88363ae94df50fbcf0a4f183\AndroidManifest.xml:7:5-44
MERGED from [com.simplecityapps:recyclerview-fastscroll:1.0.11] C:\Users\Janah\.gradle\caches\transforms-1\files-1.1\recyclerview-fastscroll-1.0.11.aar\8316747a88363ae94df50fbcf0a4f183\AndroidManifest.xml:7:5-44
MERGED from [com.android.support:cardview-v7:25.3.1] C:\Users\Janah\.gradle\caches\transforms-1\files-1.1\cardview-v7-25.3.1.aar\bcd2d8e6e19d48d7aeff7b5a3cdb5403\AndroidManifest.xml:20:5-43
MERGED from [com.android.support:cardview-v7:25.3.1] C:\Users\Janah\.gradle\caches\transforms-1\files-1.1\cardview-v7-25.3.1.aar\bcd2d8e6e19d48d7aeff7b5a3cdb5403\AndroidManifest.xml:20:5-43
MERGED from [com.google.firebase:firebase-database:10.2.0] C:\Users\Janah\.gradle\caches\transforms-1\files-1.1\firebase-database-10.2.0.aar\5aa5963576a39054a6f89c03db920f9b\AndroidManifest.xml:3:5-43
MERGED from [com.google.firebase:firebase-database:10.2.0] C:\Users\Janah\.gradle\caches\transforms-1\files-1.1\firebase-database-10.2.0.aar\5aa5963576a39054a6f89c03db920f9b\AndroidManifest.xml:3:5-43
MERGED from [com.google.firebase:firebase-storage:10.2.0] C:\Users\Janah\.gradle\caches\transforms-1\files-1.1\firebase-storage-10.2.0.aar\6d43ec0c514a659cdd4654983747abc9\AndroidManifest.xml:3:5-43
MERGED from [com.google.firebase:firebase-storage:10.2.0] C:\Users\Janah\.gradle\caches\transforms-1\files-1.1\firebase-storage-10.2.0.aar\6d43ec0c514a659cdd4654983747abc9\AndroidManifest.xml:3:5-43
MERGED from [com.google.firebase:firebase-auth:10.2.0] C:\Users\Janah\.gradle\caches\transforms-1\files-1.1\firebase-auth-10.2.0.aar\7076ee9dce4eb003cc40b622d00d2929\AndroidManifest.xml:17:5-43
MERGED from [com.google.firebase:firebase-auth:10.2.0] C:\Users\Janah\.gradle\caches\transforms-1\files-1.1\firebase-auth-10.2.0.aar\7076ee9dce4eb003cc40b622d00d2929\AndroidManifest.xml:17:5-43
MERGED from [de.hdodenhof:circleimageview:2.1.0] C:\Users\Janah\.gradle\caches\transforms-1\files-1.1\circleimageview-2.1.0.aar\f0df384fcc7c9ad8cb024f336e615ca6\AndroidManifest.xml:5:5-7:41
MERGED from [de.hdodenhof:circleimageview:2.1.0] C:\Users\Janah\.gradle\caches\transforms-1\files-1.1\circleimageview-2.1.0.aar\f0df384fcc7c9ad8cb024f336e615ca6\AndroidManifest.xml:5:5-7:41
MERGED from [com.google.firebase:firebase-core:10.2.0] C:\Users\Janah\.gradle\caches\transforms-1\files-1.1\firebase-core-10.2.0.aar\468df92178864585bb3e2fecc575284d\AndroidManifest.xml:4:5-43
MERGED from [com.google.firebase:firebase-core:10.2.0] C:\Users\Janah\.gradle\caches\transforms-1\files-1.1\firebase-core-10.2.0.aar\468df92178864585bb3e2fecc575284d\AndroidManifest.xml:4:5-43
MERGED from [com.twotoasters.jazzylistview:library-recyclerview:1.2.1] C:\Users\Janah\.gradle\caches\transforms-1\files-1.1\library-recyclerview-1.2.1.aar\9ffe447af5543dd32d2fbba6cbc9e32d\AndroidManifest.xml:7:5-9:41
MERGED from [com.twotoasters.jazzylistview:library-recyclerview:1.2.1] C:\Users\Janah\.gradle\caches\transforms-1\files-1.1\library-recyclerview-1.2.1.aar\9ffe447af5543dd32d2fbba6cbc9e32d\AndroidManifest.xml:7:5-9:41
MERGED from [com.twotoasters.jazzylistview:library:1.2.1] C:\Users\Janah\.gradle\caches\transforms-1\files-1.1\library-1.2.1.aar\cdcdf77a581f6b6b14cc90789cd8723f\AndroidManifest.xml:7:5-9:41
MERGED from [com.twotoasters.jazzylistview:library:1.2.1] C:\Users\Janah\.gradle\caches\transforms-1\files-1.1\library-1.2.1.aar\cdcdf77a581f6b6b14cc90789cd8723f\AndroidManifest.xml:7:5-9:41
MERGED from [com.android.support:transition:25.3.1] C:\Users\Janah\.gradle\caches\transforms-1\files-1.1\transition-25.3.1.aar\2114707b5b460f21b739aa2fa40bef60\AndroidManifest.xml:20:5-44
MERGED from [com.android.support:transition:25.3.1] C:\Users\Janah\.gradle\caches\transforms-1\files-1.1\transition-25.3.1.aar\2114707b5b460f21b739aa2fa40bef60\AndroidManifest.xml:20:5-44
MERGED from [com.android.support:recyclerview-v7:25.3.1] C:\Users\Janah\.gradle\caches\transforms-1\files-1.1\recyclerview-v7-25.3.1.aar\2b94e9820404db7eb124593a2362e439\AndroidManifest.xml:20:5-43
MERGED from [com.android.support:recyclerview-v7:25.3.1] C:\Users\Janah\.gradle\caches\transforms-1\files-1.1\recyclerview-v7-25.3.1.aar\2b94e9820404db7eb124593a2362e439\AndroidManifest.xml:20:5-43
MERGED from [com.google.firebase:firebase-analytics:10.2.0] C:\Users\Janah\.gradle\caches\transforms-1\files-1.1\firebase-analytics-10.2.0.aar\24f061ab444ce3130cb8a1bdbce81666\AndroidManifest.xml:17:5-43
MERGED from [com.google.firebase:firebase-analytics:10.2.0] C:\Users\Janah\.gradle\caches\transforms-1\files-1.1\firebase-analytics-10.2.0.aar\24f061ab444ce3130cb8a1bdbce81666\AndroidManifest.xml:17:5-43
MERGED from [com.google.firebase:firebase-analytics-impl:10.2.0] C:\Users\Janah\.gradle\caches\transforms-1\files-1.1\firebase-analytics-impl-10.2.0.aar\608ad5a997fd328817be193060752850\AndroidManifest.xml:17:5-43
MERGED from [com.google.firebase:firebase-analytics-impl:10.2.0] C:\Users\Janah\.gradle\caches\transforms-1\files-1.1\firebase-analytics-impl-10.2.0.aar\608ad5a997fd328817be193060752850\AndroidManifest.xml:17:5-43
MERGED from [com.google.firebase:firebase-iid:10.2.0] C:\Users\Janah\.gradle\caches\transforms-1\files-1.1\firebase-iid-10.2.0.aar\d0f57b03a06699f08196f089500d44e6\AndroidManifest.xml:17:5-43
MERGED from [com.google.firebase:firebase-iid:10.2.0] C:\Users\Janah\.gradle\caches\transforms-1\files-1.1\firebase-iid-10.2.0.aar\d0f57b03a06699f08196f089500d44e6\AndroidManifest.xml:17:5-43
MERGED from [com.google.firebase:firebase-database-connection:10.2.0] C:\Users\Janah\.gradle\caches\transforms-1\files-1.1\firebase-database-connection-10.2.0.aar\082613b470d4127fdc8ef9918ec0db95\AndroidManifest.xml:3:5-43
MERGED from [com.google.firebase:firebase-database-connection:10.2.0] C:\Users\Janah\.gradle\caches\transforms-1\files-1.1\firebase-database-connection-10.2.0.aar\082613b470d4127fdc8ef9918ec0db95\AndroidManifest.xml:3:5-43
MERGED from [com.google.firebase:firebase-common:10.2.0] C:\Users\Janah\.gradle\caches\transforms-1\files-1.1\firebase-common-10.2.0.aar\0c362d38814ff12de00e2a7210a19d1b\AndroidManifest.xml:3:5-43
MERGED from [com.google.firebase:firebase-common:10.2.0] C:\Users\Janah\.gradle\caches\transforms-1\files-1.1\firebase-common-10.2.0.aar\0c362d38814ff12de00e2a7210a19d1b\AndroidManifest.xml:3:5-43
MERGED from [com.google.android.gms:play-services-base:10.2.0] C:\Users\Janah\.gradle\caches\transforms-1\files-1.1\play-services-base-10.2.0.aar\89e00ae2f6ad347f0e4feeb69391705d\AndroidManifest.xml:17:5-43
MERGED from [com.google.android.gms:play-services-base:10.2.0] C:\Users\Janah\.gradle\caches\transforms-1\files-1.1\play-services-base-10.2.0.aar\89e00ae2f6ad347f0e4feeb69391705d\AndroidManifest.xml:17:5-43
MERGED from [com.google.android.gms:play-services-tasks:10.2.0] C:\Users\Janah\.gradle\caches\transforms-1\files-1.1\play-services-tasks-10.2.0.aar\8d7168a16019ffd07266f72ccddc40af\AndroidManifest.xml:3:5-43
MERGED from [com.google.android.gms:play-services-tasks:10.2.0] C:\Users\Janah\.gradle\caches\transforms-1\files-1.1\play-services-tasks-10.2.0.aar\8d7168a16019ffd07266f72ccddc40af\AndroidManifest.xml:3:5-43
MERGED from [com.google.firebase:firebase-storage-common:10.2.0] C:\Users\Janah\.gradle\caches\transforms-1\files-1.1\firebase-storage-common-10.2.0.aar\7596dfbce8162e6ccb05adf596eeac13\AndroidManifest.xml:3:5-43
MERGED from [com.google.firebase:firebase-storage-common:10.2.0] C:\Users\Janah\.gradle\caches\transforms-1\files-1.1\firebase-storage-common-10.2.0.aar\7596dfbce8162e6ccb05adf596eeac13\AndroidManifest.xml:3:5-43
MERGED from [com.google.android.gms:play-services-basement:10.2.0] C:\Users\Janah\.gradle\caches\transforms-1\files-1.1\play-services-basement-10.2.0.aar\a85b193fdc8ae32eaf4a3e204b551615\AndroidManifest.xml:17:5-43
MERGED from [com.google.android.gms:play-services-basement:10.2.0] C:\Users\Janah\.gradle\caches\transforms-1\files-1.1\play-services-basement-10.2.0.aar\a85b193fdc8ae32eaf4a3e204b551615\AndroidManifest.xml:17:5-43
MERGED from [com.android.support:support-v4:25.3.1] C:\Users\Janah\.gradle\caches\transforms-1\files-1.1\support-v4-25.3.1.aar\d7734d9e82b42dd81c153aab9e9839ab\AndroidManifest.xml:21:5-23:54
MERGED from [com.android.support:support-v4:25.3.1] C:\Users\Janah\.gradle\caches\transforms-1\files-1.1\support-v4-25.3.1.aar\d7734d9e82b42dd81c153aab9e9839ab\AndroidManifest.xml:21:5-23:54
MERGED from [com.android.support:support-fragment:25.3.1] C:\Users\Janah\.gradle\caches\transforms-1\files-1.1\support-fragment-25.3.1.aar\f285717b311ee1ea94a399a4fdfdba51\AndroidManifest.xml:21:5-23:60
MERGED from [com.android.support:support-fragment:25.3.1] C:\Users\Janah\.gradle\caches\transforms-1\files-1.1\support-fragment-25.3.1.aar\f285717b311ee1ea94a399a4fdfdba51\AndroidManifest.xml:21:5-23:60
MERGED from [com.android.support:support-core-ui:25.3.1] C:\Users\Janah\.gradle\caches\transforms-1\files-1.1\support-core-ui-25.3.1.aar\7ef3ef791c560d545dc9b4cd09e2b96c\AndroidManifest.xml:21:5-23:58
MERGED from [com.android.support:support-core-ui:25.3.1] C:\Users\Janah\.gradle\caches\transforms-1\files-1.1\support-core-ui-25.3.1.aar\7ef3ef791c560d545dc9b4cd09e2b96c\AndroidManifest.xml:21:5-23:58
MERGED from [com.android.support:animated-vector-drawable:25.3.1] C:\Users\Janah\.gradle\caches\transforms-1\files-1.1\animated-vector-drawable-25.3.1.aar\b4745ef14b40364a825a12ffdb41ba68\AndroidManifest.xml:20:5-44
MERGED from [com.android.support:animated-vector-drawable:25.3.1] C:\Users\Janah\.gradle\caches\transforms-1\files-1.1\animated-vector-drawable-25.3.1.aar\b4745ef14b40364a825a12ffdb41ba68\AndroidManifest.xml:20:5-44
MERGED from [com.android.support:support-vector-drawable:25.3.1] C:\Users\Janah\.gradle\caches\transforms-1\files-1.1\support-vector-drawable-25.3.1.aar\66be67059cf1f725b6b3ef55c2d8f62c\AndroidManifest.xml:20:5-43
MERGED from [com.android.support:support-vector-drawable:25.3.1] C:\Users\Janah\.gradle\caches\transforms-1\files-1.1\support-vector-drawable-25.3.1.aar\66be67059cf1f725b6b3ef55c2d8f62c\AndroidManifest.xml:20:5-43
MERGED from [com.android.support:support-media-compat:25.3.1] C:\Users\Janah\.gradle\caches\transforms-1\files-1.1\support-media-compat-25.3.1.aar\a958c1d33345d99a5a917249dbd96004\AndroidManifest.xml:21:5-23:63
MERGED from [com.android.support:support-media-compat:25.3.1] C:\Users\Janah\.gradle\caches\transforms-1\files-1.1\support-media-compat-25.3.1.aar\a958c1d33345d99a5a917249dbd96004\AndroidManifest.xml:21:5-23:63
MERGED from [com.android.support:support-core-utils:25.3.1] C:\Users\Janah\.gradle\caches\transforms-1\files-1.1\support-core-utils-25.3.1.aar\2e818a72ca1669f5e00bb52b75e786aa\AndroidManifest.xml:21:5-23:61
MERGED from [com.android.support:support-core-utils:25.3.1] C:\Users\Janah\.gradle\caches\transforms-1\files-1.1\support-core-utils-25.3.1.aar\2e818a72ca1669f5e00bb52b75e786aa\AndroidManifest.xml:21:5-23:61
MERGED from [com.android.support:support-compat:25.3.1] C:\Users\Janah\.gradle\caches\transforms-1\files-1.1\support-compat-25.3.1.aar\8859a71adc1908fae2e34b34b95f1bb1\AndroidManifest.xml:21:5-23:58
MERGED from [com.android.support:support-compat:25.3.1] C:\Users\Janah\.gradle\caches\transforms-1\files-1.1\support-compat-25.3.1.aar\8859a71adc1908fae2e34b34b95f1bb1\AndroidManifest.xml:21:5-23:58
INJECTED from D:\Informatique de gestion\Session ete 2018\Programmation mobile 2\ProjetFitness\app\src\main\AndroidManifest.xml
INJECTED from D:\Informatique de gestion\Session ete 2018\Programmation mobile 2\ProjetFitness\app\src\main\AndroidManifest.xml
	tools:overrideLibrary
		ADDED from [com.android.support:design:25.3.1] C:\Users\Janah\.gradle\caches\transforms-1\files-1.1\design-25.3.1.aar\0e2070721a9a891b7a7330fb9fca55d5\AndroidManifest.xml:23:9-59
	android:targetSdkVersion
		INJECTED from D:\Informatique de gestion\Session ete 2018\Programmation mobile 2\ProjetFitness\app\src\main\AndroidManifest.xml
		ADDED from D:\Informatique de gestion\Session ete 2018\Programmation mobile 2\ProjetFitness\app\src\main\AndroidManifest.xml
		INJECTED from D:\Informatique de gestion\Session ete 2018\Programmation mobile 2\ProjetFitness\app\src\main\AndroidManifest.xml
	android:minSdkVersion
		INJECTED from D:\Informatique de gestion\Session ete 2018\Programmation mobile 2\ProjetFitness\app\src\main\AndroidManifest.xml
		ADDED from D:\Informatique de gestion\Session ete 2018\Programmation mobile 2\ProjetFitness\app\src\main\AndroidManifest.xml
		INJECTED from D:\Informatique de gestion\Session ete 2018\Programmation mobile 2\ProjetFitness\app\src\main\AndroidManifest.xml
meta-data#android.support.VERSION
ADDED from [com.android.support:design:25.3.1] C:\Users\Janah\.gradle\caches\transforms-1\files-1.1\design-25.3.1.aar\0e2070721a9a891b7a7330fb9fca55d5\AndroidManifest.xml:25:5-27:34
MERGED from [com.android.support:appcompat-v7:25.3.1] C:\Users\Janah\.gradle\caches\transforms-1\files-1.1\appcompat-v7-25.3.1.aar\20ab1132e95f01ccb9793ac7d0fe9445\AndroidManifest.xml:25:5-27:34
MERGED from [com.android.support:appcompat-v7:25.3.1] C:\Users\Janah\.gradle\caches\transforms-1\files-1.1\appcompat-v7-25.3.1.aar\20ab1132e95f01ccb9793ac7d0fe9445\AndroidManifest.xml:25:5-27:34
MERGED from [com.android.support:cardview-v7:25.3.1] C:\Users\Janah\.gradle\caches\transforms-1\files-1.1\cardview-v7-25.3.1.aar\bcd2d8e6e19d48d7aeff7b5a3cdb5403\AndroidManifest.xml:22:5-24:34
MERGED from [com.android.support:cardview-v7:25.3.1] C:\Users\Janah\.gradle\caches\transforms-1\files-1.1\cardview-v7-25.3.1.aar\bcd2d8e6e19d48d7aeff7b5a3cdb5403\AndroidManifest.xml:22:5-24:34
MERGED from [com.android.support:transition:25.3.1] C:\Users\Janah\.gradle\caches\transforms-1\files-1.1\transition-25.3.1.aar\2114707b5b460f21b739aa2fa40bef60\AndroidManifest.xml:22:5-24:34
MERGED from [com.android.support:transition:25.3.1] C:\Users\Janah\.gradle\caches\transforms-1\files-1.1\transition-25.3.1.aar\2114707b5b460f21b739aa2fa40bef60\AndroidManifest.xml:22:5-24:34
MERGED from [com.android.support:recyclerview-v7:25.3.1] C:\Users\Janah\.gradle\caches\transforms-1\files-1.1\recyclerview-v7-25.3.1.aar\2b94e9820404db7eb124593a2362e439\AndroidManifest.xml:22:5-24:34
MERGED from [com.android.support:recyclerview-v7:25.3.1] C:\Users\Janah\.gradle\caches\transforms-1\files-1.1\recyclerview-v7-25.3.1.aar\2b94e9820404db7eb124593a2362e439\AndroidManifest.xml:22:5-24:34
MERGED from [com.android.support:support-v4:25.3.1] C:\Users\Janah\.gradle\caches\transforms-1\files-1.1\support-v4-25.3.1.aar\d7734d9e82b42dd81c153aab9e9839ab\AndroidManifest.xml:25:5-27:34
MERGED from [com.android.support:support-v4:25.3.1] C:\Users\Janah\.gradle\caches\transforms-1\files-1.1\support-v4-25.3.1.aar\d7734d9e82b42dd81c153aab9e9839ab\AndroidManifest.xml:25:5-27:34
MERGED from [com.android.support:support-fragment:25.3.1] C:\Users\Janah\.gradle\caches\transforms-1\files-1.1\support-fragment-25.3.1.aar\f285717b311ee1ea94a399a4fdfdba51\AndroidManifest.xml:25:5-27:34
MERGED from [com.android.support:support-fragment:25.3.1] C:\Users\Janah\.gradle\caches\transforms-1\files-1.1\support-fragment-25.3.1.aar\f285717b311ee1ea94a399a4fdfdba51\AndroidManifest.xml:25:5-27:34
MERGED from [com.android.support:support-core-ui:25.3.1] C:\Users\Janah\.gradle\caches\transforms-1\files-1.1\support-core-ui-25.3.1.aar\7ef3ef791c560d545dc9b4cd09e2b96c\AndroidManifest.xml:25:5-27:34
MERGED from [com.android.support:support-core-ui:25.3.1] C:\Users\Janah\.gradle\caches\transforms-1\files-1.1\support-core-ui-25.3.1.aar\7ef3ef791c560d545dc9b4cd09e2b96c\AndroidManifest.xml:25:5-27:34
MERGED from [com.android.support:animated-vector-drawable:25.3.1] C:\Users\Janah\.gradle\caches\transforms-1\files-1.1\animated-vector-drawable-25.3.1.aar\b4745ef14b40364a825a12ffdb41ba68\AndroidManifest.xml:22:5-24:34
MERGED from [com.android.support:animated-vector-drawable:25.3.1] C:\Users\Janah\.gradle\caches\transforms-1\files-1.1\animated-vector-drawable-25.3.1.aar\b4745ef14b40364a825a12ffdb41ba68\AndroidManifest.xml:22:5-24:34
MERGED from [com.android.support:support-vector-drawable:25.3.1] C:\Users\Janah\.gradle\caches\transforms-1\files-1.1\support-vector-drawable-25.3.1.aar\66be67059cf1f725b6b3ef55c2d8f62c\AndroidManifest.xml:22:5-24:34
MERGED from [com.android.support:support-vector-drawable:25.3.1] C:\Users\Janah\.gradle\caches\transforms-1\files-1.1\support-vector-drawable-25.3.1.aar\66be67059cf1f725b6b3ef55c2d8f62c\AndroidManifest.xml:22:5-24:34
MERGED from [com.android.support:support-media-compat:25.3.1] C:\Users\Janah\.gradle\caches\transforms-1\files-1.1\support-media-compat-25.3.1.aar\a958c1d33345d99a5a917249dbd96004\AndroidManifest.xml:25:5-27:34
MERGED from [com.android.support:support-media-compat:25.3.1] C:\Users\Janah\.gradle\caches\transforms-1\files-1.1\support-media-compat-25.3.1.aar\a958c1d33345d99a5a917249dbd96004\AndroidManifest.xml:25:5-27:34
MERGED from [com.android.support:support-core-utils:25.3.1] C:\Users\Janah\.gradle\caches\transforms-1\files-1.1\support-core-utils-25.3.1.aar\2e818a72ca1669f5e00bb52b75e786aa\AndroidManifest.xml:25:5-27:34
MERGED from [com.android.support:support-core-utils:25.3.1] C:\Users\Janah\.gradle\caches\transforms-1\files-1.1\support-core-utils-25.3.1.aar\2e818a72ca1669f5e00bb52b75e786aa\AndroidManifest.xml:25:5-27:34
MERGED from [com.android.support:support-compat:25.3.1] C:\Users\Janah\.gradle\caches\transforms-1\files-1.1\support-compat-25.3.1.aar\8859a71adc1908fae2e34b34b95f1bb1\AndroidManifest.xml:25:5-27:34
MERGED from [com.android.support:support-compat:25.3.1] C:\Users\Janah\.gradle\caches\transforms-1\files-1.1\support-compat-25.3.1.aar\8859a71adc1908fae2e34b34b95f1bb1\AndroidManifest.xml:25:5-27:34
	android:value
		ADDED from [com.android.support:design:25.3.1] C:\Users\Janah\.gradle\caches\transforms-1\files-1.1\design-25.3.1.aar\0e2070721a9a891b7a7330fb9fca55d5\AndroidManifest.xml:27:9-31
	android:name
		ADDED from [com.android.support:design:25.3.1] C:\Users\Janah\.gradle\caches\transforms-1\files-1.1\design-25.3.1.aar\0e2070721a9a891b7a7330fb9fca55d5\AndroidManifest.xml:26:9-47
uses-permission#android.permission.WAKE_LOCK
ADDED from [com.google.firebase:firebase-analytics:10.2.0] C:\Users\Janah\.gradle\caches\transforms-1\files-1.1\firebase-analytics-10.2.0.aar\24f061ab444ce3130cb8a1bdbce81666\AndroidManifest.xml:22:5-67
MERGED from [com.google.firebase:firebase-analytics-impl:10.2.0] C:\Users\Janah\.gradle\caches\transforms-1\files-1.1\firebase-analytics-impl-10.2.0.aar\608ad5a997fd328817be193060752850\AndroidManifest.xml:22:5-67
MERGED from [com.google.firebase:firebase-analytics-impl:10.2.0] C:\Users\Janah\.gradle\caches\transforms-1\files-1.1\firebase-analytics-impl-10.2.0.aar\608ad5a997fd328817be193060752850\AndroidManifest.xml:22:5-67
MERGED from [com.google.firebase:firebase-iid:10.2.0] C:\Users\Janah\.gradle\caches\transforms-1\files-1.1\firebase-iid-10.2.0.aar\d0f57b03a06699f08196f089500d44e6\AndroidManifest.xml:21:5-67
MERGED from [com.google.firebase:firebase-iid:10.2.0] C:\Users\Janah\.gradle\caches\transforms-1\files-1.1\firebase-iid-10.2.0.aar\d0f57b03a06699f08196f089500d44e6\AndroidManifest.xml:21:5-67
	android:name
		ADDED from [com.google.firebase:firebase-analytics:10.2.0] C:\Users\Janah\.gradle\caches\transforms-1\files-1.1\firebase-analytics-10.2.0.aar\24f061ab444ce3130cb8a1bdbce81666\AndroidManifest.xml:22:22-65
receiver#com.google.android.gms.measurement.AppMeasurementReceiver
ADDED from [com.google.firebase:firebase-analytics:10.2.0] C:\Users\Janah\.gradle\caches\transforms-1\files-1.1\firebase-analytics-10.2.0.aar\24f061ab444ce3130cb8a1bdbce81666\AndroidManifest.xml:25:7-26:18
MERGED from [com.google.firebase:firebase-analytics-impl:10.2.0] C:\Users\Janah\.gradle\caches\transforms-1\files-1.1\firebase-analytics-impl-10.2.0.aar\608ad5a997fd328817be193060752850\AndroidManifest.xml:25:7-26:18
MERGED from [com.google.firebase:firebase-analytics-impl:10.2.0] C:\Users\Janah\.gradle\caches\transforms-1\files-1.1\firebase-analytics-impl-10.2.0.aar\608ad5a997fd328817be193060752850\AndroidManifest.xml:25:7-26:18
	android:enabled
		ADDED from [com.google.firebase:firebase-analytics:10.2.0] C:\Users\Janah\.gradle\caches\transforms-1\files-1.1\firebase-analytics-10.2.0.aar\24f061ab444ce3130cb8a1bdbce81666\AndroidManifest.xml:25:90-112
	android:exported
		ADDED from [com.google.firebase:firebase-analytics:10.2.0] C:\Users\Janah\.gradle\caches\transforms-1\files-1.1\firebase-analytics-10.2.0.aar\24f061ab444ce3130cb8a1bdbce81666\AndroidManifest.xml:25:113-137
	android:name
		ADDED from [com.google.firebase:firebase-analytics:10.2.0] C:\Users\Janah\.gradle\caches\transforms-1\files-1.1\firebase-analytics-10.2.0.aar\24f061ab444ce3130cb8a1bdbce81666\AndroidManifest.xml:25:17-89
receiver#com.google.android.gms.measurement.AppMeasurementInstallReferrerReceiver
ADDED from [com.google.firebase:firebase-analytics:10.2.0] C:\Users\Janah\.gradle\caches\transforms-1\files-1.1\firebase-analytics-10.2.0.aar\24f061ab444ce3130cb8a1bdbce81666\AndroidManifest.xml:27:7-31:18
	android:enabled
		ADDED from [com.google.firebase:firebase-analytics:10.2.0] C:\Users\Janah\.gradle\caches\transforms-1\files-1.1\firebase-analytics-10.2.0.aar\24f061ab444ce3130cb8a1bdbce81666\AndroidManifest.xml:27:162-184
	android:permission
		ADDED from [com.google.firebase:firebase-analytics:10.2.0] C:\Users\Janah\.gradle\caches\transforms-1\files-1.1\firebase-analytics-10.2.0.aar\24f061ab444ce3130cb8a1bdbce81666\AndroidManifest.xml:27:105-161
	android:name
		ADDED from [com.google.firebase:firebase-analytics:10.2.0] C:\Users\Janah\.gradle\caches\transforms-1\files-1.1\firebase-analytics-10.2.0.aar\24f061ab444ce3130cb8a1bdbce81666\AndroidManifest.xml:27:17-104
intent-filter#action:name:com.android.vending.INSTALL_REFERRER
ADDED from [com.google.firebase:firebase-analytics:10.2.0] C:\Users\Janah\.gradle\caches\transforms-1\files-1.1\firebase-analytics-10.2.0.aar\24f061ab444ce3130cb8a1bdbce81666\AndroidManifest.xml:28:11-30:27
action#com.android.vending.INSTALL_REFERRER
ADDED from [com.google.firebase:firebase-analytics:10.2.0] C:\Users\Janah\.gradle\caches\transforms-1\files-1.1\firebase-analytics-10.2.0.aar\24f061ab444ce3130cb8a1bdbce81666\AndroidManifest.xml:29:15-76
	android:name
		ADDED from [com.google.firebase:firebase-analytics:10.2.0] C:\Users\Janah\.gradle\caches\transforms-1\files-1.1\firebase-analytics-10.2.0.aar\24f061ab444ce3130cb8a1bdbce81666\AndroidManifest.xml:29:23-74
service#com.google.android.gms.measurement.AppMeasurementService
ADDED from [com.google.firebase:firebase-analytics:10.2.0] C:\Users\Janah\.gradle\caches\transforms-1\files-1.1\firebase-analytics-10.2.0.aar\24f061ab444ce3130cb8a1bdbce81666\AndroidManifest.xml:32:7-137
MERGED from [com.google.firebase:firebase-analytics-impl:10.2.0] C:\Users\Janah\.gradle\caches\transforms-1\files-1.1\firebase-analytics-impl-10.2.0.aar\608ad5a997fd328817be193060752850\AndroidManifest.xml:27:7-137
MERGED from [com.google.firebase:firebase-analytics-impl:10.2.0] C:\Users\Janah\.gradle\caches\transforms-1\files-1.1\firebase-analytics-impl-10.2.0.aar\608ad5a997fd328817be193060752850\AndroidManifest.xml:27:7-137
	android:enabled
		ADDED from [com.google.firebase:firebase-analytics:10.2.0] C:\Users\Janah\.gradle\caches\transforms-1\files-1.1\firebase-analytics-10.2.0.aar\24f061ab444ce3130cb8a1bdbce81666\AndroidManifest.xml:32:88-110
	android:exported
		ADDED from [com.google.firebase:firebase-analytics:10.2.0] C:\Users\Janah\.gradle\caches\transforms-1\files-1.1\firebase-analytics-10.2.0.aar\24f061ab444ce3130cb8a1bdbce81666\AndroidManifest.xml:32:111-135
	android:name
		ADDED from [com.google.firebase:firebase-analytics:10.2.0] C:\Users\Janah\.gradle\caches\transforms-1\files-1.1\firebase-analytics-10.2.0.aar\24f061ab444ce3130cb8a1bdbce81666\AndroidManifest.xml:32:16-87
uses-permission#com.google.android.c2dm.permission.RECEIVE
ADDED from [com.google.firebase:firebase-iid:10.2.0] C:\Users\Janah\.gradle\caches\transforms-1\files-1.1\firebase-iid-10.2.0.aar\d0f57b03a06699f08196f089500d44e6\AndroidManifest.xml:22:5-81
	android:name
		ADDED from [com.google.firebase:firebase-iid:10.2.0] C:\Users\Janah\.gradle\caches\transforms-1\files-1.1\firebase-iid-10.2.0.aar\d0f57b03a06699f08196f089500d44e6\AndroidManifest.xml:22:22-79
permission#${applicationId}.permission.C2D_MESSAGE
ADDED from [com.google.firebase:firebase-iid:10.2.0] C:\Users\Janah\.gradle\caches\transforms-1\files-1.1\firebase-iid-10.2.0.aar\d0f57b03a06699f08196f089500d44e6\AndroidManifest.xml:24:5-109
	android:protectionLevel
		ADDED from [com.google.firebase:firebase-iid:10.2.0] C:\Users\Janah\.gradle\caches\transforms-1\files-1.1\firebase-iid-10.2.0.aar\d0f57b03a06699f08196f089500d44e6\AndroidManifest.xml:24:72-107
	android:name
		ADDED from [com.google.firebase:firebase-iid:10.2.0] C:\Users\Janah\.gradle\caches\transforms-1\files-1.1\firebase-iid-10.2.0.aar\d0f57b03a06699f08196f089500d44e6\AndroidManifest.xml:24:17-71
permission#com.globalfitness.permission.C2D_MESSAGE
ADDED from [com.google.firebase:firebase-iid:10.2.0] C:\Users\Janah\.gradle\caches\transforms-1\files-1.1\firebase-iid-10.2.0.aar\d0f57b03a06699f08196f089500d44e6\AndroidManifest.xml:24:5-109
	android:protectionLevel
		ADDED from [com.google.firebase:firebase-iid:10.2.0] C:\Users\Janah\.gradle\caches\transforms-1\files-1.1\firebase-iid-10.2.0.aar\d0f57b03a06699f08196f089500d44e6\AndroidManifest.xml:24:72-107
	android:name
		ADDED from [com.google.firebase:firebase-iid:10.2.0] C:\Users\Janah\.gradle\caches\transforms-1\files-1.1\firebase-iid-10.2.0.aar\d0f57b03a06699f08196f089500d44e6\AndroidManifest.xml:24:17-71
uses-permission#${applicationId}.permission.C2D_MESSAGE
ADDED from [com.google.firebase:firebase-iid:10.2.0] C:\Users\Janah\.gradle\caches\transforms-1\files-1.1\firebase-iid-10.2.0.aar\d0f57b03a06699f08196f089500d44e6\AndroidManifest.xml:26:5-78
	android:name
		ADDED from [com.google.firebase:firebase-iid:10.2.0] C:\Users\Janah\.gradle\caches\transforms-1\files-1.1\firebase-iid-10.2.0.aar\d0f57b03a06699f08196f089500d44e6\AndroidManifest.xml:26:22-76
uses-permission#com.globalfitness.permission.C2D_MESSAGE
ADDED from [com.google.firebase:firebase-iid:10.2.0] C:\Users\Janah\.gradle\caches\transforms-1\files-1.1\firebase-iid-10.2.0.aar\d0f57b03a06699f08196f089500d44e6\AndroidManifest.xml:26:5-78
	android:name
		ADDED from [com.google.firebase:firebase-iid:10.2.0] C:\Users\Janah\.gradle\caches\transforms-1\files-1.1\firebase-iid-10.2.0.aar\d0f57b03a06699f08196f089500d44e6\AndroidManifest.xml:26:22-76
receiver#com.google.firebase.iid.FirebaseInstanceIdReceiver
ADDED from [com.google.firebase:firebase-iid:10.2.0] C:\Users\Janah\.gradle\caches\transforms-1\files-1.1\firebase-iid-10.2.0.aar\d0f57b03a06699f08196f089500d44e6\AndroidManifest.xml:30:9-36:20
	android:exported
		ADDED from [com.google.firebase:firebase-iid:10.2.0] C:\Users\Janah\.gradle\caches\transforms-1\files-1.1\firebase-iid-10.2.0.aar\d0f57b03a06699f08196f089500d44e6\AndroidManifest.xml:30:85-108
	android:permission
		ADDED from [com.google.firebase:firebase-iid:10.2.0] C:\Users\Janah\.gradle\caches\transforms-1\files-1.1\firebase-iid-10.2.0.aar\d0f57b03a06699f08196f089500d44e6\AndroidManifest.xml:30:109-169
	android:name
		ADDED from [com.google.firebase:firebase-iid:10.2.0] C:\Users\Janah\.gradle\caches\transforms-1\files-1.1\firebase-iid-10.2.0.aar\d0f57b03a06699f08196f089500d44e6\AndroidManifest.xml:30:19-84
intent-filter#action:name:com.google.android.c2dm.intent.RECEIVE+action:name:com.google.android.c2dm.intent.REGISTRATION+category:name:${applicationId}
ADDED from [com.google.firebase:firebase-iid:10.2.0] C:\Users\Janah\.gradle\caches\transforms-1\files-1.1\firebase-iid-10.2.0.aar\d0f57b03a06699f08196f089500d44e6\AndroidManifest.xml:31:13-35:29
intent-filter#action:name:com.google.android.c2dm.intent.RECEIVE+action:name:com.google.android.c2dm.intent.REGISTRATION+category:name:com.globalfitness
ADDED from [com.google.firebase:firebase-iid:10.2.0] C:\Users\Janah\.gradle\caches\transforms-1\files-1.1\firebase-iid-10.2.0.aar\d0f57b03a06699f08196f089500d44e6\AndroidManifest.xml:31:13-35:29
action#com.google.android.c2dm.intent.RECEIVE
ADDED from [com.google.firebase:firebase-iid:10.2.0] C:\Users\Janah\.gradle\caches\transforms-1\files-1.1\firebase-iid-10.2.0.aar\d0f57b03a06699f08196f089500d44e6\AndroidManifest.xml:32:17-80
	android:name
		ADDED from [com.google.firebase:firebase-iid:10.2.0] C:\Users\Janah\.gradle\caches\transforms-1\files-1.1\firebase-iid-10.2.0.aar\d0f57b03a06699f08196f089500d44e6\AndroidManifest.xml:32:25-78
action#com.google.android.c2dm.intent.REGISTRATION
ADDED from [com.google.firebase:firebase-iid:10.2.0] C:\Users\Janah\.gradle\caches\transforms-1\files-1.1\firebase-iid-10.2.0.aar\d0f57b03a06699f08196f089500d44e6\AndroidManifest.xml:33:17-85
	android:name
		ADDED from [com.google.firebase:firebase-iid:10.2.0] C:\Users\Janah\.gradle\caches\transforms-1\files-1.1\firebase-iid-10.2.0.aar\d0f57b03a06699f08196f089500d44e6\AndroidManifest.xml:33:25-83
category#${applicationId}
ADDED from [com.google.firebase:firebase-iid:10.2.0] C:\Users\Janah\.gradle\caches\transforms-1\files-1.1\firebase-iid-10.2.0.aar\d0f57b03a06699f08196f089500d44e6\AndroidManifest.xml:34:17-60
	android:name
		ADDED from [com.google.firebase:firebase-iid:10.2.0] C:\Users\Janah\.gradle\caches\transforms-1\files-1.1\firebase-iid-10.2.0.aar\d0f57b03a06699f08196f089500d44e6\AndroidManifest.xml:34:27-58
category#com.globalfitness
ADDED from [com.google.firebase:firebase-iid:10.2.0] C:\Users\Janah\.gradle\caches\transforms-1\files-1.1\firebase-iid-10.2.0.aar\d0f57b03a06699f08196f089500d44e6\AndroidManifest.xml:34:17-60
	android:name
		ADDED from [com.google.firebase:firebase-iid:10.2.0] C:\Users\Janah\.gradle\caches\transforms-1\files-1.1\firebase-iid-10.2.0.aar\d0f57b03a06699f08196f089500d44e6\AndroidManifest.xml:34:27-58
receiver#com.google.firebase.iid.FirebaseInstanceIdInternalReceiver
ADDED from [com.google.firebase:firebase-iid:10.2.0] C:\Users\Janah\.gradle\caches\transforms-1\files-1.1\firebase-iid-10.2.0.aar\d0f57b03a06699f08196f089500d44e6\AndroidManifest.xml:40:9-119
	android:exported
		ADDED from [com.google.firebase:firebase-iid:10.2.0] C:\Users\Janah\.gradle\caches\transforms-1\files-1.1\firebase-iid-10.2.0.aar\d0f57b03a06699f08196f089500d44e6\AndroidManifest.xml:40:93-117
	android:name
		ADDED from [com.google.firebase:firebase-iid:10.2.0] C:\Users\Janah\.gradle\caches\transforms-1\files-1.1\firebase-iid-10.2.0.aar\d0f57b03a06699f08196f089500d44e6\AndroidManifest.xml:40:19-92
service#com.google.firebase.iid.FirebaseInstanceIdService
ADDED from [com.google.firebase:firebase-iid:10.2.0] C:\Users\Janah\.gradle\caches\transforms-1\files-1.1\firebase-iid-10.2.0.aar\d0f57b03a06699f08196f089500d44e6\AndroidManifest.xml:44:9-48:19
	android:exported
		ADDED from [com.google.firebase:firebase-iid:10.2.0] C:\Users\Janah\.gradle\caches\transforms-1\files-1.1\firebase-iid-10.2.0.aar\d0f57b03a06699f08196f089500d44e6\AndroidManifest.xml:44:83-106
	android:name
		ADDED from [com.google.firebase:firebase-iid:10.2.0] C:\Users\Janah\.gradle\caches\transforms-1\files-1.1\firebase-iid-10.2.0.aar\d0f57b03a06699f08196f089500d44e6\AndroidManifest.xml:44:18-82
intent-filter#action:name:com.google.firebase.INSTANCE_ID_EVENT
ADDED from [com.google.firebase:firebase-iid:10.2.0] C:\Users\Janah\.gradle\caches\transforms-1\files-1.1\firebase-iid-10.2.0.aar\d0f57b03a06699f08196f089500d44e6\AndroidManifest.xml:45:13-47:29
	android:priority
		ADDED from [com.google.firebase:firebase-iid:10.2.0] C:\Users\Janah\.gradle\caches\transforms-1\files-1.1\firebase-iid-10.2.0.aar\d0f57b03a06699f08196f089500d44e6\AndroidManifest.xml:45:28-51
action#com.google.firebase.INSTANCE_ID_EVENT
ADDED from [com.google.firebase:firebase-iid:10.2.0] C:\Users\Janah\.gradle\caches\transforms-1\files-1.1\firebase-iid-10.2.0.aar\d0f57b03a06699f08196f089500d44e6\AndroidManifest.xml:46:17-79
	android:name
		ADDED from [com.google.firebase:firebase-iid:10.2.0] C:\Users\Janah\.gradle\caches\transforms-1\files-1.1\firebase-iid-10.2.0.aar\d0f57b03a06699f08196f089500d44e6\AndroidManifest.xml:46:25-77
provider#com.google.firebase.provider.FirebaseInitProvider
ADDED from [com.google.firebase:firebase-common:10.2.0] C:\Users\Janah\.gradle\caches\transforms-1\files-1.1\firebase-common-10.2.0.aar\0c362d38814ff12de00e2a7210a19d1b\AndroidManifest.xml:6:9-194
	android:authorities
		ADDED from [com.google.firebase:firebase-common:10.2.0] C:\Users\Janah\.gradle\caches\transforms-1\files-1.1\firebase-common-10.2.0.aar\0c362d38814ff12de00e2a7210a19d1b\AndroidManifest.xml:6:19-78
	android:exported
		ADDED from [com.google.firebase:firebase-common:10.2.0] C:\Users\Janah\.gradle\caches\transforms-1\files-1.1\firebase-common-10.2.0.aar\0c362d38814ff12de00e2a7210a19d1b\AndroidManifest.xml:6:144-168
	android:initOrder
		ADDED from [com.google.firebase:firebase-common:10.2.0] C:\Users\Janah\.gradle\caches\transforms-1\files-1.1\firebase-common-10.2.0.aar\0c362d38814ff12de00e2a7210a19d1b\AndroidManifest.xml:6:169-192
	android:name
		ADDED from [com.google.firebase:firebase-common:10.2.0] C:\Users\Janah\.gradle\caches\transforms-1\files-1.1\firebase-common-10.2.0.aar\0c362d38814ff12de00e2a7210a19d1b\AndroidManifest.xml:6:79-143
activity#com.google.android.gms.common.api.GoogleApiActivity
ADDED from [com.google.android.gms:play-services-base:10.2.0] C:\Users\Janah\.gradle\caches\transforms-1\files-1.1\play-services-base-10.2.0.aar\89e00ae2f6ad347f0e4feeb69391705d\AndroidManifest.xml:19:9-172
	android:exported
		ADDED from [com.google.android.gms:play-services-base:10.2.0] C:\Users\Janah\.gradle\caches\transforms-1\files-1.1\play-services-base-10.2.0.aar\89e00ae2f6ad347f0e4feeb69391705d\AndroidManifest.xml:19:146-170
	android:theme
		ADDED from [com.google.android.gms:play-services-base:10.2.0] C:\Users\Janah\.gradle\caches\transforms-1\files-1.1\play-services-base-10.2.0.aar\89e00ae2f6ad347f0e4feeb69391705d\AndroidManifest.xml:19:86-145
	android:name
		ADDED from [com.google.android.gms:play-services-base:10.2.0] C:\Users\Janah\.gradle\caches\transforms-1\files-1.1\play-services-base-10.2.0.aar\89e00ae2f6ad347f0e4feeb69391705d\AndroidManifest.xml:19:19-85
meta-data#com.google.android.gms.version
ADDED from [com.google.android.gms:play-services-basement:10.2.0] C:\Users\Janah\.gradle\caches\transforms-1\files-1.1\play-services-basement-10.2.0.aar\a85b193fdc8ae32eaf4a3e204b551615\AndroidManifest.xml:20:9-121
	android:value
		ADDED from [com.google.android.gms:play-services-basement:10.2.0] C:\Users\Janah\.gradle\caches\transforms-1\files-1.1\play-services-basement-10.2.0.aar\a85b193fdc8ae32eaf4a3e204b551615\AndroidManifest.xml:20:66-119
	android:name
		ADDED from [com.google.android.gms:play-services-basement:10.2.0] C:\Users\Janah\.gradle\caches\transforms-1\files-1.1\play-services-basement-10.2.0.aar\a85b193fdc8ae32eaf4a3e204b551615\AndroidManifest.xml:20:20-65
