<svg xmlns="http://www.w3.org/2000/svg" width="16.817" height="17.199" viewBox="0 0 16.817 17.199">
  <g id="calendar" transform="translate(-5.411)">
    <g id="Group_185" data-name="Group 185" transform="translate(5.411)">
      <path id="Path_647" data-name="Path 647" d="M119.178,258.632a.39.39,0,0,0-.39-.39h-1.362a.39.39,0,0,0-.39.39v1.362a.39.39,0,0,0,.39.39h1.362a.39.39,0,0,0,.39-.39v-1.362Z" transform="translate(-113.102 -249.144)" fill="#a0a0a1"/>
      <path id="Path_648" data-name="Path 648" d="M215.813,258.632a.39.39,0,0,0-.39-.39H214.06a.39.39,0,0,0-.39.39v1.362a.39.39,0,0,0,.39.39h1.362a.39.39,0,0,0,.39-.39Z" transform="translate(-206.333 -249.144)" fill="#a0a0a1"/>
      <path id="Path_649" data-name="Path 649" d="M312.441,258.632a.39.39,0,0,0-.39-.39h-1.362a.39.39,0,0,0-.39.39v1.362a.39.39,0,0,0,.39.39h1.362a.39.39,0,0,0,.39-.39Z" transform="translate(-299.556 -249.144)" fill="#a0a0a1"/>
      <path id="Path_650" data-name="Path 650" d="M119.178,355.265a.39.39,0,0,0-.39-.39h-1.362a.39.39,0,0,0-.39.39v1.362a.39.39,0,0,0,.39.39h1.362a.39.39,0,0,0,.39-.39v-1.362Z" transform="translate(-113.102 -342.372)" fill="#a0a0a1"/>
      <path id="Path_651" data-name="Path 651" d="M215.813,355.265a.39.39,0,0,0-.39-.39H214.06a.39.39,0,0,0-.39.39v1.362a.39.39,0,0,0,.39.39h1.362a.39.39,0,0,0,.39-.39Z" transform="translate(-206.333 -342.372)" fill="#a0a0a1"/>
      <path id="Path_652" data-name="Path 652" d="M312.441,355.265a.39.39,0,0,0-.39-.39h-1.362a.39.39,0,0,0-.39.39v1.362a.39.39,0,0,0,.39.39h1.362a.39.39,0,0,0,.39-.39v-1.362Z" transform="translate(-299.556 -342.372)" fill="#a0a0a1"/>
      <path id="Path_653" data-name="Path 653" d="M20.731,54.149v2.08a1.7,1.7,0,0,1-1.7,1.7H17.954a1.708,1.708,0,0,1-1.713-1.7V54.142H11.4V56.23a1.708,1.708,0,0,1-1.713,1.7H8.611a1.7,1.7,0,0,1-1.7-1.7v-2.08a1.549,1.549,0,0,0-1.5,1.54V67.882a1.549,1.549,0,0,0,1.542,1.551H20.687a1.551,1.551,0,0,0,1.542-1.551V55.69A1.549,1.549,0,0,0,20.731,54.149Zm-.5,12.974a.667.667,0,0,1-.666.666H8.044a.667.667,0,0,1-.666-.666v-6.3a.667.667,0,0,1,.666-.667H19.566a.667.667,0,0,1,.666.667v6.3Z" transform="translate(-5.411 -52.234)" fill="#a0a0a1"/>
      <path id="Path_654" data-name="Path 654" d="M80.134,4.578H81.2a.584.584,0,0,0,.584-.584V.584A.584.584,0,0,0,81.2,0H80.134a.584.584,0,0,0-.584.584V3.995A.584.584,0,0,0,80.134,4.578Z" transform="translate(-76.938)" fill="#a0a0a1"/>
      <path id="Path_655" data-name="Path 655" d="M345.042,4.578H346.1a.584.584,0,0,0,.584-.584V.584A.584.584,0,0,0,346.1,0h-1.063a.584.584,0,0,0-.584.584V3.995A.584.584,0,0,0,345.042,4.578Z" transform="translate(-332.513)" fill="#a0a0a1"/>
    </g>
  </g>
</svg>
