<svg xmlns="http://www.w3.org/2000/svg" width="10.403" height="16.495" viewBox="0 0 10.403 16.495">
  <g id="chevron-pointing-to-the-left" transform="translate(-82.083)">
    <path id="Path_190" data-name="Path 190" d="M86.946,8.253,92.094,3.1a1.3,1.3,0,0,0,.392-.959,1.3,1.3,0,0,0-.392-.959L91.3.392a1.369,1.369,0,0,0-1.917,0l-6.907,6.9a1.368,1.368,0,0,0,0,1.918l6.907,6.9a1.368,1.368,0,0,0,1.917,0l.794-.795a1.3,1.3,0,0,0,.392-.954,1.332,1.332,0,0,0-.392-.964Z" transform="translate(0 0)" fill="#2d3747"/>
  </g>
</svg>
