<svg xmlns="http://www.w3.org/2000/svg" width="669.609" height="412.732" viewBox="0 0 669.609 412.732">
  <g id="_1" data-name="1" transform="translate(-65.196 -177.634)">
    <rect id="Rectangle_1" data-name="Rectangle 1" width="36.076" height="230.762" transform="translate(320.036 309.897)" fill="#003b7a"/>
    <path id="Path_1" data-name="Path 1" d="M533.911,540.659H401.425V309.9H437.5V508h96.409Z" fill="#003b7a"/>
    <path id="Path_2" data-name="Path 2" d="M551.938,540.659,670.427,345.974H577.751V309.9H734.8L616.316,504.582H731.694v36.077Z" fill="#003b7a"/>
    <path id="Path_3" data-name="Path 3" d="M327.119,574.833v11.773H323.6V574.833l-7.921-10.743h3.794l5.887,8.012,5.887-8.012h3.764Z" fill="#003b7a"/>
    <path id="Path_4" data-name="Path 4" d="M340.995,585.727a11.252,11.252,0,0,1-6.89-10.379,11.521,11.521,0,0,1,.88-4.4,11.861,11.861,0,0,1,2.428-3.583,11.124,11.124,0,0,1,3.582-2.4,11.261,11.261,0,0,1,4.368-.879,11.538,11.538,0,0,1,4.4.879,11.085,11.085,0,0,1,5.978,5.98,11.5,11.5,0,0,1,.88,4.4,11.237,11.237,0,0,1-.88,4.369,11.066,11.066,0,0,1-2.4,3.581,11.915,11.915,0,0,1-3.581,2.429,11.519,11.519,0,0,1-4.4.879,11.243,11.243,0,0,1-4.368-.879M339.9,569.886a7.693,7.693,0,1,0,5.462-2.277,7.7,7.7,0,0,0-5.462,2.277" fill="#003b7a"/>
    <path id="Path_5" data-name="Path 5" d="M362.946,584.815a6.646,6.646,0,0,1-2-2.427,7.563,7.563,0,0,1-.759-3.43V564.089h3.52v14.869a3.663,3.663,0,0,0,1.4,3.066,5.631,5.631,0,0,0,3.43,1.062,5.762,5.762,0,0,0,3.43-1.062,3.642,3.642,0,0,0,1.365-3.066V564.089h3.55v14.869a7.975,7.975,0,0,1-.759,3.43,7.3,7.3,0,0,1-2,2.427,9.6,9.6,0,0,1-11.168,0" fill="#003b7a"/>
    <path id="Path_6" data-name="Path 6" d="M397.124,586.606h-3.975l-5.675-7.617h-2.58v7.617h-3.52V564.09h6.677a7.151,7.151,0,0,1,5.613,2.246,8.348,8.348,0,0,1,0,10.409,6.305,6.305,0,0,1-2.609,1.729Zm-9.073-10.773a4.14,4.14,0,0,0,3.246-1.214,5.239,5.239,0,0,0,0-6.16,4.129,4.129,0,0,0-3.246-1.185h-3.157v8.559Z" fill="#003b7a"/>
    <path id="Path_7" data-name="Path 7" d="M424.418,567.245h-6.191v19.361h-3.55V567.245h-6.19v-3.156h15.932Z" fill="#003b7a"/>
    <path id="Path_8" data-name="Path 8" d="M443.422,586.606h-3.976l-5.675-7.617h-2.58v7.617h-3.519V564.09h6.677a7.153,7.153,0,0,1,5.613,2.246,8.351,8.351,0,0,1,0,10.409,6.31,6.31,0,0,1-2.61,1.729Zm-9.073-10.773a4.142,4.142,0,0,0,3.246-1.214,5.239,5.239,0,0,0,0-6.16,4.13,4.13,0,0,0-3.246-1.185h-3.158v8.559Z" fill="#003b7a"/>
    <path id="Path_9" data-name="Path 9" d="M448.253,584.815a6.646,6.646,0,0,1-2-2.427,7.55,7.55,0,0,1-.76-3.43V564.089h3.521v14.869a3.665,3.665,0,0,0,1.394,3.066,5.636,5.636,0,0,0,3.431,1.062,5.762,5.762,0,0,0,3.43-1.062,3.642,3.642,0,0,0,1.365-3.066V564.089h3.55v14.869a7.975,7.975,0,0,1-.759,3.43,7.326,7.326,0,0,1-2,2.427,9.6,9.6,0,0,1-11.168,0" fill="#003b7a"/>
    <path id="Path_10" data-name="Path 10" d="M477.881,582.084a6.529,6.529,0,0,1-5.069,4.4,7,7,0,0,1-1.366.12,7.291,7.291,0,0,1-2.669-.484,8.921,8.921,0,0,1-3.734-2.885l2.793-2.183a5.033,5.033,0,0,0,2.215,1.759,3.467,3.467,0,0,0,2.064.183,2.986,2.986,0,0,0,2.367-1.882,2.639,2.639,0,0,0-1.032-2.55c-1-.94-2.64-2.548-2.761-2.671l-2.761-2.608a6.421,6.421,0,0,1-1.731-2.7,4.83,4.83,0,0,1-.06-2.854,5.123,5.123,0,0,1,1.67-2.517,5.824,5.824,0,0,1,2.7-1.274,5.991,5.991,0,0,1,3.339.241,7.6,7.6,0,0,1,3.064,2.276l-2.763,2.216a2.991,2.991,0,0,0-2.973-1.274,2.064,2.064,0,0,0-1.638,1.3c-.122.425-.092,1.124.85,2.033l3.761,3.611c.547.547,1.215,1.183,1.7,1.64a6.739,6.739,0,0,1,1.971,2.942,5.319,5.319,0,0,1,.062,3.156" fill="#003b7a"/>
    <path id="Path_11" data-name="Path 11" d="M495.731,567.245H489.54v19.361h-3.55V567.245H479.8v-3.156h15.933Z" fill="#003b7a"/>
    <rect id="Rectangle_2" data-name="Rectangle 2" width="3.52" height="22.517" transform="translate(508.093 564.089)" fill="#003b7a"/>
    <path id="Path_12" data-name="Path 12" d="M528.095,582.084a6.531,6.531,0,0,1-5.069,4.4,7.01,7.01,0,0,1-1.366.12,7.313,7.313,0,0,1-2.671-.484,8.892,8.892,0,0,1-3.73-2.885l2.791-2.183a5.024,5.024,0,0,0,2.216,1.759,3.462,3.462,0,0,0,2.063.183,2.987,2.987,0,0,0,2.366-1.882,2.635,2.635,0,0,0-1.032-2.55c-1-.94-2.639-2.548-2.762-2.671l-2.761-2.608a6.4,6.4,0,0,1-1.728-2.7,4.806,4.806,0,0,1-.06-2.854,5.123,5.123,0,0,1,1.667-2.517,5.836,5.836,0,0,1,2.7-1.274,5.978,5.978,0,0,1,3.336.241,7.592,7.592,0,0,1,3.066,2.276l-2.763,2.216a2.989,2.989,0,0,0-2.971-1.274,2.063,2.063,0,0,0-1.64,1.3c-.121.425-.091,1.124.849,2.033l3.762,3.611c.548.547,1.214,1.183,1.7,1.64a6.763,6.763,0,0,1,1.974,2.942,5.367,5.367,0,0,1,.06,3.156" fill="#003b7a"/>
    <path id="Path_13" data-name="Path 13" d="M547.466,585.727a11.248,11.248,0,0,1-6.889-10.379,11.519,11.519,0,0,1,.879-4.4,11.849,11.849,0,0,1,2.43-3.583,11.094,11.094,0,0,1,3.58-2.4,11.258,11.258,0,0,1,4.369-.879,11.545,11.545,0,0,1,4.4.879,11.087,11.087,0,0,1,5.977,5.98,11.5,11.5,0,0,1,.88,4.4,11.237,11.237,0,0,1-.88,4.369,11.1,11.1,0,0,1-2.4,3.581,11.923,11.923,0,0,1-3.58,2.429,11.527,11.527,0,0,1-4.4.879,11.24,11.24,0,0,1-4.369-.879m-1.093-15.841a7.69,7.69,0,1,0,5.462-2.277,7.692,7.692,0,0,0-5.462,2.277" fill="#003b7a"/>
    <path id="Path_14" data-name="Path 14" d="M569.418,584.815a6.622,6.622,0,0,1-2-2.427,7.562,7.562,0,0,1-.758-3.43V564.089h3.521v14.869a3.662,3.662,0,0,0,1.393,3.066A5.634,5.634,0,0,0,575,583.086a5.756,5.756,0,0,0,3.429-1.062,3.639,3.639,0,0,0,1.365-3.066V564.089h3.552v14.869a8.019,8.019,0,0,1-.759,3.43,7.311,7.311,0,0,1-2.005,2.427,9.6,9.6,0,0,1-11.165,0" fill="#003b7a"/>
    <path id="Path_15" data-name="Path 15" d="M603.595,586.606h-3.977l-5.673-7.617h-2.581v7.617h-3.52V564.09h6.675a7.158,7.158,0,0,1,5.616,2.246,8.355,8.355,0,0,1,0,10.409,6.321,6.321,0,0,1-2.611,1.729Zm-9.076-10.773a4.15,4.15,0,0,0,3.25-1.214,5.243,5.243,0,0,0,0-6.16,4.138,4.138,0,0,0-3.25-1.185h-3.155v8.559Z" fill="#003b7a"/>
    <path id="Path_16" data-name="Path 16" d="M634.041,586.606V574.649l-7.04,10.5-7.069-10.5v11.957h-3.521v-23.55L627,578.838l10.594-15.781v23.55Z" fill="#003b7a"/>
    <rect id="Rectangle_3" data-name="Rectangle 3" width="3.52" height="22.517" transform="translate(642.307 564.089)" fill="#003b7a"/>
    <path id="Path_17" data-name="Path 17" d="M662.31,582.084a6.529,6.529,0,0,1-5.069,4.4,7.011,7.011,0,0,1-1.366.12,7.31,7.31,0,0,1-2.671-.484,8.892,8.892,0,0,1-3.73-2.885l2.791-2.183a5.027,5.027,0,0,0,2.215,1.759,3.463,3.463,0,0,0,2.063.183,2.987,2.987,0,0,0,2.367-1.882,2.633,2.633,0,0,0-1.033-2.55c-1-.94-2.638-2.548-2.761-2.671l-2.761-2.608a6.446,6.446,0,0,1-1.729-2.7,4.814,4.814,0,0,1-.06-2.854,5.118,5.118,0,0,1,1.668-2.517,5.836,5.836,0,0,1,2.7-1.274,5.976,5.976,0,0,1,3.336.241,7.579,7.579,0,0,1,3.066,2.276l-2.762,2.216A2.99,2.99,0,0,0,655.6,567.4a2.066,2.066,0,0,0-1.64,1.3c-.12.425-.091,1.124.851,2.033l3.761,3.611c.548.547,1.214,1.183,1.7,1.64a6.762,6.762,0,0,1,1.973,2.942,5.335,5.335,0,0,1,.061,3.156" fill="#003b7a"/>
    <path id="Path_18" data-name="Path 18" d="M677.641,582.084a6.529,6.529,0,0,1-5.069,4.4,7.014,7.014,0,0,1-1.367.12,7.312,7.312,0,0,1-2.67-.484,8.892,8.892,0,0,1-3.73-2.885l2.791-2.183a5.027,5.027,0,0,0,2.215,1.759,3.465,3.465,0,0,0,2.064.183,2.987,2.987,0,0,0,2.366-1.882,2.635,2.635,0,0,0-1.032-2.55c-1-.94-2.639-2.548-2.762-2.671l-2.761-2.608a6.433,6.433,0,0,1-1.728-2.7,4.814,4.814,0,0,1-.061-2.854,5.125,5.125,0,0,1,1.668-2.517,5.835,5.835,0,0,1,2.7-1.274,5.973,5.973,0,0,1,3.335.241,7.582,7.582,0,0,1,3.067,2.276l-2.763,2.216a2.989,2.989,0,0,0-2.971-1.274,2.063,2.063,0,0,0-1.64,1.3c-.121.425-.092,1.124.85,2.033l3.761,3.611c.549.547,1.215,1.183,1.7,1.64a6.761,6.761,0,0,1,1.973,2.942,5.327,5.327,0,0,1,.061,3.156" fill="#003b7a"/>
    <rect id="Rectangle_4" data-name="Rectangle 4" width="3.52" height="22.517" transform="translate(681.289 564.089)" fill="#003b7a"/>
    <path id="Path_19" data-name="Path 19" d="M695.645,585.727a11.248,11.248,0,0,1-6.889-10.379,11.519,11.519,0,0,1,.879-4.4,11.867,11.867,0,0,1,2.43-3.583,11.093,11.093,0,0,1,3.58-2.4,11.258,11.258,0,0,1,4.369-.879,11.542,11.542,0,0,1,4.4.879,11.094,11.094,0,0,1,5.978,5.98,11.519,11.519,0,0,1,.879,4.4,11.254,11.254,0,0,1-.879,4.369A11.116,11.116,0,0,1,708,583.3a11.91,11.91,0,0,1-3.58,2.429,11.523,11.523,0,0,1-4.4.879,11.24,11.24,0,0,1-4.369-.879m-1.093-15.841a7.691,7.691,0,1,0,5.462-2.277,7.692,7.692,0,0,0-5.462,2.277" fill="#003b7a"/>
    <path id="Path_20" data-name="Path 20" d="M718.78,572.132v14.474H715.26V563.027L729.4,578.534V564.09h3.553v23.549Z" fill="#003b7a"/>
    <path id="Path_21" data-name="Path 21" d="M362.609,220.889a53.273,53.273,0,1,0-89.016,48.616L183.427,490.013l-59.9-140.18a51.683,51.683,0,0,0-47.542-31.387H65.2l119.3,271.92,127.2-306.2a56.1,56.1,0,0,0,8.59-.95,53.267,53.267,0,0,0,42.322-62.324m-15.481,7.366-9.612,27.592a8.7,8.7,0,0,1-6.542,5.643l-28.691,5.468a8.59,8.59,0,0,1-8.14-2.821l-19.078-22.1a8.617,8.617,0,0,1-1.623-8.489l9.59-27.567a8.687,8.687,0,0,1,6.542-5.668l28.69-5.468a8.608,8.608,0,0,1,8.14,2.846l19.076,22.074a8.68,8.68,0,0,1,1.648,8.489" fill="#003b7a"/>
  </g>
</svg>
