<svg xmlns="http://www.w3.org/2000/svg" width="22.116" height="18.165" viewBox="0 0 22.116 18.165">
  <g id="hide" transform="translate(0 -5.274)">
    <path id="Path_260" data-name="Path 260" d="M4.227,23.49a.375.375,0,1,0,.467-.586,10.25,10.25,0,0,1-.863-.772L1.06,19.362,3.917,16.5a10.111,10.111,0,0,1,10.427-2.447.375.375,0,0,0,.239-.711,10.857,10.857,0,0,0-11.2,2.628L0,19.362l3.3,3.3A11.056,11.056,0,0,0,4.227,23.49Z" transform="translate(0 -4.689)" fill="#595959"/>
    <path id="Path_261" data-name="Path 261" d="M30.638,18.957A11,11,0,0,0,28.992,17.6a.375.375,0,0,0-.418.622,10.241,10.241,0,0,1,1.533,1.262l2.771,2.771-2.857,2.857A10.21,10.21,0,0,1,19.4,27.5a.375.375,0,0,0-.253.705,10.956,10.956,0,0,0,11.4-2.556l3.387-3.387Z" transform="translate(-11.822 -7.672)" fill="#595959"/>
    <path id="Path_262" data-name="Path 262" d="M25.787,29.611a4.3,4.3,0,0,1-2.273-.648.374.374,0,1,0-.4.636,5.057,5.057,0,0,0,6.873-7.105.374.374,0,0,0-.622.416,4.308,4.308,0,0,1-3.582,6.7Z" transform="translate(-14.349 -10.667)" fill="#595959"/>
    <path id="Path_263" data-name="Path 263" d="M22.095,17.523a4.3,4.3,0,0,1,2.193.6.375.375,0,0,0,.382-.645,5.058,5.058,0,0,0-7.117,6.578.375.375,0,0,0,.673-.33,4.267,4.267,0,0,1-.438-1.9A4.313,4.313,0,0,1,22.095,17.523Z" transform="translate(-10.657 -7.193)" fill="#595959"/>
    <path id="Path_264" data-name="Path 264" d="M24.469,5.384a.374.374,0,0,0-.53,0L6.524,22.8a.374.374,0,1,0,.53.53L24.469,5.913A.374.374,0,0,0,24.469,5.384Z" transform="translate(-4.012 0)" fill="#595959"/>
  </g>
</svg>
