{
  "$schema": "./node_modules/@angular/cli/lib/config/schema.json",
  "version": 1,
  "newProjectRoot": "projects",
  "projects": {
    "mfe-shell": {
      "projectType": "application",
      "schematics": {
        "@schematics/angular:component": {
          "style": "scss"
        },
        "@schematics/angular:application": {
          "strict": true
        }
      },
      "root": "",
      "sourceRoot": "src",
      "prefix": "app",
      "architect": {
        "build": {
          "builder": "ngx-build-plus:browser",
          "options": {
            "outputPath": "dist/mfe-shell",
            "index": "src/index.html",
            "main": "src/main.ts",
            "polyfills": "src/polyfills.ts",
            "tsConfig": "tsconfig.app.json",
            "inlineStyleLanguage": "scss",
            "assets": [
              "src/favicon.ico",
              "src/assets"
            ],
            "styles": [
              "src/styles.scss"
            ],
            "scripts": [],
            "extraWebpackConfig": "webpack.config.js",
            "commonChunk": false
          },
          "configurations": {
            "production": {
              "budgets": [
                {
                  "type": "initial",
                  "maximumWarning": "500kb",
                  "maximumError": "1mb"
                },
                {
                  "type": "anyComponentStyle",
                  "maximumWarning": "2kb",
                  "maximumError": "4kb"
                }
              ],
              "fileReplacements": [
                {
                  "replace": "src/environments/environment.ts",
                  "with": "src/environments/environment.prod.ts"
                }
              ],
              "outputHashing": "all",
              "extraWebpackConfig": "webpack.prod.config.js"
            },
            "development": {
              "buildOptimizer": false,
              "optimization": false,
              "vendorChunk": true,
              "extractLicenses": false,
              "sourceMap": true,
              "namedChunks": true
            }
          },
          "defaultConfiguration": "production"
        },
        "serve": {
          "builder": "ngx-build-plus:dev-server",
          "configurations": {
            "production": {
              "browserTarget": "mfe-shell:build:production",
              "extraWebpackConfig": "webpack.prod.config.js"
            },
            "development": {
              "browserTarget": "mfe-shell:build:development"
            }
          },
          "defaultConfiguration": "development",
          "options": {
            "extraWebpackConfig": "webpack.config.js",
            "port": 8000
          }
        },
        "extract-i18n": {
          "builder": "ngx-build-plus:extract-i18n",
          "options": {
            "browserTarget": "mfe-shell:build",
            "extraWebpackConfig": "webpack.config.js"
          }
        },
        "test": {
          "builder": "ngx-build-plus:karma",
          "options": {
            "main": "src/test.ts",
            "polyfills": "src/polyfills.ts",
            "tsConfig": "tsconfig.spec.json",
            "karmaConfig": "karma.conf.js",
            "inlineStyleLanguage": "scss",
            "assets": [
              "src/favicon.ico",
              "src/assets"
            ],
            "styles": [
              "src/styles.scss"
            ],
            "scripts": [],
            "extraWebpackConfig": "webpack.config.js"
          }
        }
      }
    }
  },
  "defaultProject": "mfe-shell"
}