<svg width="648" height="291" viewBox="0 0 648 291" fill="none" xmlns="http://www.w3.org/2000/svg">
<path d="M613.082 225.402L562.569 272.515L464.457 263.772C453.966 263.384 448.429 257.782 446.972 255.029L438.715 258.429H398.887C383.345 258.429 379.783 252.601 379.945 249.687L381.888 199.174C365.957 252.407 323.765 264.743 304.661 264.258C263.862 264.258 242.977 229.287 237.634 211.802L231.806 224.916L239.577 241.43C241.131 246.092 238.929 252.439 237.634 255.029L191.007 290L167.207 264.258C131.848 267.366 108.113 255.839 100.666 249.687L37.5246 195.288C6.05105 168.089 0.125479 133.766 1.09688 120.004C3.42826 53.5601 56.467 20.759 82.6949 12.6639C148.362 -5.20994 194.892 31.1206 209.949 51.5201V23.3494C209.949 11.6925 217.396 8.45449 221.12 8.29259H285.719C301.65 6.73834 305.956 17.6828 306.118 23.3494L312.918 89.4049V28.2064C309.809 4.11555 321.337 0.359452 327.489 1.49276L397.43 2.94987L404.23 7.32122L407.144 4.89267L490.199 7.32122C493.308 0.327101 506.066 0.521382 512.056 1.49279L623.282 16.0639C645.041 17.6181 648.214 30.6349 647.081 36.9491L642.224 76.291C641.836 82.1194 640.119 85.8431 639.31 86.9764L594.14 144.289L613.568 146.718C627.167 147.495 627.977 159.346 626.682 165.174L617.939 211.802C617.162 219.185 614.377 223.945 613.082 225.402Z" fill="#56A0D3" stroke="#56A0D3"/>
<path d="M500.399 14.6067L496.514 68.034L567.426 70.9482C557.712 77.1652 507.685 127.29 483.885 151.575V205.488C502.148 205.876 572.769 212.773 605.797 216.173L613.082 160.317L551.884 151.575L629.596 79.6908L634.453 30.1492C623.573 27.4292 540.551 18.6542 500.399 14.6067Z" fill="white"/>
<path d="M410.059 19.9495L402.288 198.688H460.086C460.086 193.248 480.486 77.2624 490.685 19.9495H410.059Z" fill="white"/>
<path d="M394.516 15.5781H325.546C330.209 132.535 311.622 157.241 301.747 154.975C276.879 155.363 285.233 66.0912 292.518 21.4066H224.034C211.212 129.038 237.148 175.374 250.748 187.031C291.547 222.002 336.231 197.393 351.774 181.203C391.796 146.232 396.944 56.2152 394.516 15.5781Z" fill="white"/>
<path d="M204.606 197.717L157.979 233.173L143.893 203.059C84.0548 213.551 46.7528 186.384 35.5816 171.489C-0.166063 122.141 19.5536 71.434 41.8958 49.5774C69.0952 20.4352 112.808 17.8635 134.179 21.8924C181.584 30.8293 203.149 65.1199 208.006 81.1481C221.994 128.553 197.968 164.689 184.207 176.831L204.606 197.717Z" fill="white"/>
<path d="M25.8678 91.8335C14.2109 132.632 34.9342 162.26 46.753 171.974C25.7706 147.884 24.7345 115.309 27.325 102.033C32.7271 74.3482 57.5817 53.9487 70.5525 46.6632C116.014 20.6295 162.998 39.7014 180.807 52.4916C163.71 32.6749 127.704 29.016 111.837 29.6636C58.6042 30.4407 32.3439 71.434 25.8678 91.8335Z" fill="#E9E9E9"/>
<path d="M280.376 32.5776H234.234C227.434 69.1672 222.383 150.409 256.576 182.66" stroke="#E9E9E9" stroke-width="2"/>
<path d="M295.919 164.689C309.195 174.727 335.747 170.031 335.747 70.9481V24.8064H386.745" stroke="#E9E9E9" stroke-width="2"/>
<path d="M575.683 77.7479L494.085 158.86V197.231" stroke="#E9E9E9" stroke-width="2"/>
<path d="M553.826 161.774L602.882 167.117M413.944 190.917L419.287 30.6348H473.685" stroke="#E9E9E9" stroke-width="2"/>
<path d="M508.656 58.8056V26.7493L621.824 38.8918" stroke="#E9E9E9" stroke-width="2"/>
<path d="M152.636 199.659L161.379 218.116" stroke="#E9E9E9" stroke-width="2"/>
<circle cx="112.323" cy="115.147" r="34.9706" fill="#56A0D3"/>
</svg>
