<svg width="48" height="48" viewBox="0 0 48 48" fill="none" xmlns="http://www.w3.org/2000/svg">
<path fill-rule="evenodd" clip-rule="evenodd" d="M24 6C14.0589 6 6 14.0589 6 24C6 33.9411 14.0589 42 24 42C33.9411 42 42 33.9411 42 24C42 14.0589 33.9411 6 24 6ZM2 24C2 11.8497 11.8497 2 24 2C36.1503 2 46 11.8497 46 24C46 36.1503 36.1503 46 24 46C11.8497 46 2 36.1503 2 24Z" fill="#75A6F1"/>
<path fill-rule="evenodd" clip-rule="evenodd" d="M24 10C25.1046 10 26 10.8954 26 12V24.3436C26 24.3434 26 24.3437 26 24.3436C26.0002 24.8738 26.211 25.3827 26.586 25.7576L31.4142 30.5858C32.1953 31.3668 32.1953 32.6332 31.4142 33.4142C30.6332 34.1953 29.3668 34.1953 28.5858 33.4142L23.758 28.5864C23.7581 28.5865 23.7579 28.5864 23.758 28.5864C22.6328 27.4615 22.0003 25.9355 22 24.3444V12C22 10.8954 22.8954 10 24 10Z" fill="#75A6F1"/>
</svg>
