<svg width="24" height="24" viewBox="0 0 24 24" fill="none" xmlns="http://www.w3.org/2000/svg">
<path d="M20 5.4142L13.4142 12L20 18.5858C20.3905 18.9763 20.3905 19.6095 20 20C19.6095 20.3905 18.9763 20.3905 18.5858 20L12 13.4142L5.41421 20C5.02369 20.3905 4.39053 20.3905 4 20C3.60948 19.6095 3.60948 18.9763 4 18.5858L10.5858 12L4 5.4142C3.60948 5.02368 3.60948 4.39051 4 3.99999C4.39053 3.60946 5.02369 3.60946 5.41421 3.99999L12 10.5858L18.5858 3.99999C18.9763 3.60946 19.6095 3.60946 20 3.99999C20.3905 4.39051 20.3905 5.02367 20 5.4142Z" fill="black"/>
</svg>
