<svg width="320" height="200" viewBox="0 0 320 200" fill="none" xmlns="http://www.w3.org/2000/svg">
<rect width="320" height="200" fill="#DADADA"/>
<path d="M182.56 66.1599H129.92V116.92C129.92 121.056 133.304 124.44 137.44 124.44H175.04C179.176 124.44 182.56 121.056 182.56 116.92V107.52C193.983 107.52 203.24 98.2609 203.24 86.8399C203.24 75.4189 193.983 66.1599 182.56 66.1599ZM182.56 98.1199V75.5599C185.552 75.5599 188.421 76.7483 190.536 78.8637C192.651 80.9792 193.84 83.8483 193.84 86.8399C193.84 89.8316 192.651 92.7007 190.536 94.8161C188.421 96.9315 185.552 98.1199 182.56 98.1199Z" fill="#B1B1B1"/>
<path d="M116.76 128.2V132.526C116.76 136.09 120.65 137.6 125.408 137.6H194.592C199.348 137.6 203.24 136.09 203.24 132.526V128.2H116.76Z" fill="#B1B1B1"/>
</svg>
