<svg width="25" height="24" viewBox="0 0 25 24" fill="none" xmlns="http://www.w3.org/2000/svg">
<path fill-rule="evenodd" clip-rule="evenodd" d="M7 2C3.6963 2 1 4.65418 1 7.95C1 9.19839 1.2508 11.2379 2.64775 13.6614C4.04141 16.0792 6.54438 18.8247 10.9643 21.5419L10.9682 21.5443C11.2791 21.7335 11.6361 21.8335 12 21.8335C12.3639 21.8335 12.7209 21.7335 13.0318 21.5443L13.0357 21.5419C17.4556 18.8247 19.9586 16.0792 21.3522 13.6614C22.7492 11.2379 23 9.19839 23 7.95C23 4.65418 20.3037 2 17 2C15.2713 2 13.7957 2.92675 12.8265 3.73008C12.5092 3.99305 12.2314 4.2551 12 4.49019C11.7686 4.2551 11.4908 3.99305 11.1735 3.73008C10.2043 2.92675 8.72865 2 7 2ZM11.1978 6.59707L11.1986 6.59812C11.3874 6.85011 11.685 7 12 7C12.3154 7 12.6126 6.85077 12.8014 6.59812L12.8022 6.59707L12.8155 6.57987C12.8284 6.56326 12.8493 6.53665 12.8779 6.50149C12.9351 6.43106 13.0224 6.32683 13.1364 6.2001C13.3656 5.94534 13.6967 5.60648 14.1028 5.26992C14.9433 4.57325 15.9677 4 17 4C19.2183 4 21 5.77782 21 7.95C21 8.90861 20.8133 10.5916 19.6195 12.6626C18.4235 14.7374 16.1856 17.2556 12 19.8309C7.81444 17.2556 5.57647 14.7374 4.3805 12.6626C3.1867 10.5916 3 8.90861 3 7.95C3 5.77782 4.7817 4 7 4C8.03235 4 9.05671 4.57325 9.89723 5.26992C10.3033 5.60648 10.6344 5.94534 10.8636 6.2001C10.9776 6.32683 11.0649 6.43106 11.1221 6.50149C11.1507 6.53665 11.1716 6.56326 11.1845 6.57987L11.1978 6.59707Z" fill="black"/>
</svg>
