<svg width="16" height="16" viewBox="0 0 16 16" fill="none" xmlns="http://www.w3.org/2000/svg">
<path fill-rule="evenodd" clip-rule="evenodd" d="M8.00002 2C4.68631 2 2.00002 4.68629 2.00002 8C2.00002 11.3137 4.68631 14 8.00002 14C11.3137 14 14 11.3137 14 8C14 4.68629 11.3137 2 8.00002 2ZM0.666687 8C0.666687 3.94991 3.94993 0.666666 8.00002 0.666666C12.0501 0.666666 15.3334 3.94991 15.3334 8C15.3334 12.0501 12.0501 15.3333 8.00002 15.3333C3.94993 15.3333 0.666687 12.0501 0.666687 8Z" fill="#94A629"/>
<path fill-rule="evenodd" clip-rule="evenodd" d="M5.33335 5.3C5.70154 5.3 6.00002 5.59848 6.00002 5.96667V6.03333C6.00002 6.40152 5.70154 6.7 5.33335 6.7C4.96516 6.7 4.66669 6.40152 4.66669 6.03333V5.96667C4.66669 5.59848 4.96516 5.3 5.33335 5.3Z" fill="#94A629"/>
<path fill-rule="evenodd" clip-rule="evenodd" d="M10.6667 5.3C11.0349 5.3 11.3333 5.59848 11.3333 5.96667V6.03333C11.3333 6.40152 11.0349 6.7 10.6667 6.7C10.2985 6.7 10 6.40152 10 6.03333V5.96667C10 5.59848 10.2985 5.3 10.6667 5.3Z" fill="#94A629"/>
<path fill-rule="evenodd" clip-rule="evenodd" d="M5.12253 8.70088C5.47183 8.58444 5.84938 8.77322 5.96581 9.12251C6.23776 9.93838 6.89668 10.6667 8.00002 10.6667C9.10335 10.6667 9.76227 9.93838 10.0342 9.12251C10.1507 8.77322 10.5282 8.58444 10.8775 8.70088C11.2268 8.81731 11.4156 9.19486 11.2991 9.54415C10.9044 10.7283 9.84335 12 8.00002 12C6.15669 12 5.09561 10.7283 4.7009 9.54415C4.58446 9.19486 4.77324 8.81731 5.12253 8.70088Z" fill="#94A629"/>
</svg>
