<svg width="32" height="32" viewBox="0 0 32 32" fill="none" xmlns="http://www.w3.org/2000/svg">
<path d="M18.6667 14.6665V21.3332M5.33341 7.99984H26.6667L24.5601 26.9598C24.4879 27.6123 24.1775 28.2153 23.6884 28.6532C23.1993 29.0911 22.5659 29.3332 21.9094 29.3332H10.0907C9.43426 29.3332 8.80083 29.0911 8.31175 28.6532C7.82266 28.2153 7.51229 27.6123 7.44008 26.9598L5.33341 7.99984ZM9.79341 4.19584C10.0091 3.73846 10.3504 3.35183 10.7774 3.08105C11.2045 2.81027 11.6997 2.6665 12.2054 2.6665H19.7947C20.3006 2.66625 20.7962 2.8099 21.2235 3.08069C21.6508 3.35149 21.9923 3.73826 22.2081 4.19584L24.0001 7.99984H8.00008L9.79341 4.19584V4.19584ZM2.66675 7.99984H29.3334H2.66675ZM13.3334 14.6665V21.3332V14.6665Z" stroke="#D33B23" stroke-width="2.66667" stroke-linecap="round" stroke-linejoin="round"/>
</svg>
