<svg width="200" height="200" viewBox="0 0 200 200" fill="none" xmlns="http://www.w3.org/2000/svg">
<rect width="200" height="200" fill="url(#paint0_linear_637_7430)"/>
<path d="M67.5 60.2778C67.5 78.1961 82.0817 92.7778 100 92.7778C117.918 92.7778 132.5 78.1961 132.5 60.2778C132.5 42.3594 117.918 27.7778 100 27.7778C82.0817 27.7778 67.5 42.3594 67.5 60.2778ZM157.778 165V165C161.767 165 165 161.767 165 157.778V157.778C165 129.907 142.315 107.222 114.444 107.222H85.5556C57.6778 107.222 35 129.907 35 157.778V157.778C35 161.767 38.2335 165 42.2222 165H157.778Z" fill="white"/>
<defs>
<linearGradient id="paint0_linear_637_7430" x1="100" y1="0" x2="100" y2="200" gradientUnits="userSpaceOnUse">
<stop stop-color="#D3DCE9"/>
<stop offset="1" stop-color="#93A1B8"/>
</linearGradient>
</defs>
</svg>
