<svg width="54" height="62" viewBox="0 0 54 62" fill="none" xmlns="http://www.w3.org/2000/svg">
<path d="M28.6599 61.0562C27.7571 61.7584 26.4929 61.7584 25.5901 61.0562L1.75149 42.5151C-0.127472 41.0536 0.905953 38.0417 3.28634 38.0417H10.7594C12.1392 38.0417 13.2581 36.9238 13.2594 35.5439L13.2894 2.49773C13.2906 1.11791 14.4096 0 15.7894 0H38.4583C39.839 0 40.9583 1.11929 40.9583 2.5L40.9583 35.5417C40.9583 36.9224 42.0776 38.0417 43.4583 38.0417H50.9637C53.344 38.0417 54.3775 41.0536 52.4985 42.515L28.6599 61.0562Z" fill="#F8F8F8"/>
</svg>
