<svg width="123" height="79" viewBox="0 0 123 79" fill="none" xmlns="http://www.w3.org/2000/svg">
<path d="M61.5 62.5167C28.3 62.1167 6.66667 72.6833 0 78.0167V10.0167C10.5 6.51667 38.3 -0.383335 65.5 0.0166653C92.7 0.416665 115.167 6.85 123 10.0167V78.0167C116.333 73.0167 94.7 62.9167 61.5 62.5167Z" fill="#996251"/>
</svg>
