<svg width="40" height="40" viewBox="0 0 40 40" fill="none" xmlns="http://www.w3.org/2000/svg">
<path fill-rule="evenodd" clip-rule="evenodd" d="M27.988 8.8646C27.853 8.72931 27.6329 8.72795 27.4953 8.86555L24.3941 11.967L28.0328 15.6057L31.1349 12.5033C31.2702 12.3684 31.2715 12.1482 31.134 12.0106L27.988 8.8646ZM26.5509 17.0876L22.9122 13.4489L8.86547 27.4967L8.86346 27.4987C8.8004 27.5615 8.76299 27.6496 8.76299 27.7436V31.2379H12.2573C12.3513 31.2379 12.4394 31.2005 12.5022 31.1374L12.5041 31.1355L26.5509 17.0876ZM29.4709 7.38363C28.5159 6.42727 26.968 6.42895 26.0133 7.38363L26.0133 7.38365L7.3855 26.0129C7.38513 26.0132 7.38477 26.0136 7.3844 26.014C6.92282 26.4737 6.66724 27.0976 6.66724 27.7436V32.2858C6.66724 32.8645 7.13639 33.3337 7.71511 33.3337H12.2573C12.9034 33.3337 13.5274 33.078 13.9872 32.6163C13.9875 32.616 13.9877 32.6157 13.988 32.6154L32.6149 13.9871C33.5722 13.0323 33.5709 11.4836 32.6159 10.5286L29.4718 7.38458C29.4715 7.38429 29.4712 7.384 29.4709 7.38372C29.4709 7.38369 29.4709 7.38366 29.4709 7.38363Z" fill="#313131" stroke="#313131" stroke-width="0.5" stroke-linecap="round" stroke-linejoin="round"/>
</svg>
