<svg width="48" height="48" viewBox="0 0 48 48" fill="none" xmlns="http://www.w3.org/2000/svg">
<path d="M11.2 14.3999H36.7999L34.2719 37.1519C34.1853 37.9349 33.8129 38.6584 33.226 39.1839C32.6391 39.7094 31.8789 40 31.0911 39.9999H16.9088C16.121 40 15.3609 39.7094 14.7739 39.1839C14.187 38.6584 13.8146 37.9349 13.728 37.1519L11.2 14.3999Z" stroke="white" stroke-width="4" stroke-linecap="round" stroke-linejoin="round"/>
<path d="M16.5519 9.8352C16.8107 9.28635 17.2202 8.8224 17.7327 8.49746C18.2452 8.17252 18.8395 7.99999 19.4463 8H28.5535C29.1606 7.99969 29.7552 8.17207 30.268 8.49703C30.7808 8.82198 31.1906 9.2861 31.4495 9.8352L33.5999 14.4H14.3999L16.5519 9.8352Z" stroke="white" stroke-width="4" stroke-linecap="round" stroke-linejoin="round"/>
<path d="M8 14.3999H40" stroke="white" stroke-width="4" stroke-linecap="round" stroke-linejoin="round"/>
<path d="M20.8 22.3999V30.3999" stroke="white" stroke-width="4" stroke-linecap="round" stroke-linejoin="round"/>
<path d="M27.2 22.3999V30.3999" stroke="white" stroke-width="4" stroke-linecap="round" stroke-linejoin="round"/>
</svg>
