<svg width="62" height="53" viewBox="0 0 62 53" fill="none" xmlns="http://www.w3.org/2000/svg">
<path d="M61.4322 24.9651C62.1344 25.8679 62.1344 27.1321 61.4322 28.0349L42.891 51.8735C41.4296 53.7525 38.4176 52.719 38.4176 50.3387L38.4176 42.8656C38.4176 41.4858 37.2997 40.3669 35.9199 40.3656L2.87371 40.3356C1.49389 40.3343 0.375978 39.2154 0.375978 37.8356L0.37598 15.1667C0.37598 13.7859 1.49527 12.6667 2.87598 12.6667L35.9176 12.6667C37.2984 12.6667 38.4176 11.5474 38.4176 10.1667L38.4176 2.66134C38.4176 0.280954 41.4296 -0.752474 42.891 1.12649L61.4322 24.9651Z" fill="#F8F8F8"/>
</svg>
